program: Gaussian 09
title: 000254258
version: EM64L-G09RevD.01
frameworkgroup: C1[X(C17H20ClN3O)]
method: RPBEPBE
basis: SDD
operation: Freq
keyword: #p
keyword: freq=noraman
keyword: PBEPBE/SDD
title: #p freq=noraman PBEPBE/SDD
converged: YES YES NO NO
title: Mulliken charges:
elementType: Cl O N N N C C C C C C C C C C C C C C C C C H H H H H H H H H H H H H H H H H H H H
charge: -0.075645 -0.267482 -0.466854 -0.162864 -0.673269 -0.382015 -0.342190 -0.289746 0.346191 -0.687009 0.435984 -0.368186 -0.346353 -0.435572 -0.331361 0.205234 0.241524 -0.363069 -0.359258 -0.194906 -0.198665 -0.121440 0.209370 0.209495 0.193748 0.193761 0.201040 0.200963 0.212157 0.212073 0.217560 0.248834 0.246508 0.214262 0.315604 0.293673 0.254547 0.256354 0.251591 0.249821 0.349574 0.306015
chargesum: 0.00000
title: Mulliken charges with hydrogens summed into heavy atoms:
elementType: Cl O N N N C C C C C C C C C C C C C C C C C
charge: -0.075645 -0.267482 -0.173181 -0.162864 -0.017680 0.036850 0.045318 0.112257 0.346191 -0.045219 0.435984 -0.119352 -0.099845 -0.221310 -0.015757 0.205234 0.241524 -0.108522 -0.102904 0.056685 0.051156 -0.121440
polarizability: 3.72883924e+02 -3.49037577e+01 2.26612695e+02 -6.59473546e+00 -1.29944336e+01 1.39953825e+02
1716.lowfreq: -9.6069 -6.1610 -1.8283 -0.0015 -0.0005 0.0003 19.7772 21.7199 27.2537
frequency: 19.7011 21.5224 27.2347 38.0213 51.7717 59.8985 79.4166 84.9095 95.3300 115.9806 148.4539 163.7128 180.1343 194.3850 217.4761 222.8003 251.7526 269.0375 280.0096 320.2015 358.9892 368.0691 383.3763 399.9848 410.1516 414.3329 430.3012 469.5018 487.3974 506.4628 519.1924 538.4825 561.8503 584.9454 622.7727 632.2427 649.6605 687.2771 712.2390 717.9169 742.4716 760.3034 791.4946 808.4800 815.1682 816.3952 831.1777 837.6818 852.0016 903.0474 935.9593 938.3513 939.9321 955.4156 969.5322 974.3137 984.0026 990.6717 1001.4113 1041.6129 1049.1800 1068.0633 1081.9806 1098.1893 1117.1778 1125.0259 1145.2318 1172.0233 1176.2136 1212.2382 1214.0556 1233.7956 1269.0068 1274.7212 1279.6185 1282.2129 1286.1021 1306.3405 1332.2849 1342.8089 1347.8200 1376.6667 1389.9194 1392.1724 1400.2672 1423.1891 1468.6125 1469.6788 1473.3807 1475.5392 1482.0410 1489.9495 1502.7381 1527.8176 1563.0139 1590.9913 1597.2111 1619.9738 1631.0875 1651.7793 2940.9388 2967.2599 2976.0424 2994.3216 2996.8960 3011.0923 3058.5294 3074.6028 3076.2924 3108.3746 3136.0221 3151.8028 3157.2348 3164.5787 3165.8981 3173.2728 3182.4024 3540.3292 3546.1744 3681.2677
redmass: 5.8836 4.2575 3.6972 3.0744 4.2474 2.0435 4.1258 5.0420 6.3800 4.0803 1.9298 5.9308 4.7107 5.8519 4.4503 1.1451 4.8440 2.4235 1.9905 4.3825 3.5958 5.1918 7.5150 3.6015 2.9432 3.1187 4.6947 1.2036 3.4310 2.9316 1.8896 1.5041 4.2388 6.3021 7.1595 7.0790 7.2094 5.5162 3.8576 3.7071 1.0758 5.7441 5.0757 1.2444 1.2815 1.2688 1.7328 1.4601 4.8734 1.8001 1.3575 1.3188 1.1496 1.3505 6.5057 1.3190 6.4480 3.7593 2.6097 3.4512 1.5844 2.6552 2.1916 1.3354 1.4472 2.2190 1.4407 1.1178 1.2104 1.3780 2.6616 2.6134 3.6309 1.3460 1.1758 1.2978 1.0733 1.4593 2.5417 4.6071 1.4723 1.5856 1.9327 1.7768 3.8831 4.0271 1.7979 1.2753 1.0868 1.0430 1.1236 1.1604 2.0153 2.8562 7.5057 5.2542 5.2070 1.3702 5.8396 3.5335 1.0550 1.0589 1.0363 1.0593 1.1057 1.1010 1.1042 1.1014 1.0994 1.0896 1.0885 1.0882 1.0890 1.0959 1.0944 1.0974 1.0953 1.0492 1.0711 1.1040
irintensity: 0.7604 1.6932 0.1379 0.1280 1.2805 0.0532 5.2747 2.1665 0.5014 0.5009 2.4373 4.6452 2.0305 1.5961 2.0025 0.1769 10.0724 21.6198 50.0740 5.6149 12.3752 7.2183 2.1981 6.5746 4.1856 0.8005 11.8447 250.3578 4.4078 15.1075 53.2361 26.9067 6.6447 50.4766 1.0699 1.8931 9.2190 6.4881 8.1562 0.1771 10.8063 18.0468 11.4314 6.0256 29.0584 4.1209 63.4857 62.1053 3.2149 22.2659 0.1181 0.3207 0.1920 0.7489 64.1576 3.2471 42.6352 13.0840 17.7892 27.9057 13.4952 48.5474 8.3124 14.5141 9.4500 12.7490 1.6370 20.5119 88.5193 0.5924 345.3042 86.9182 41.8090 10.5158 0.7177 0.3394 0.0879 11.3463 30.1869 7.6828 1.4191 71.3935 12.0759 28.6732 7.6464 32.9765 260.6079 73.8885 3.3356 13.0986 55.6624 68.1053 133.1690 936.7881 6.8680 181.8590 19.8525 172.3439 20.5455 753.6367 28.8729 32.8630 38.3208 39.6557 28.5949 5.0563 18.7941 103.1435 49.0332 25.1622 9.5140 5.7005 10.8198 8.3169 7.8602 3.4599 16.4019 45.9464 24.8913 31.4766
temp: 298.150 k
press: 1.00000 atm
elementType: 17 8 7 7 7 6 6 6 6 6 6 6 6 6 6 6 6 6 6 6 6 6 1 1 1 1 1 1 1 1 1 1 1 1 1 1 1 1 1 1 1 1
symmnumber: 1
zpe: 886610.9 jmol-1
zpe.correction: 0.337692 hartree
zpe.thermalcorrener: 0.360010 hartree
zpe.thermalcorrenthalpy: 0.360954 hartree
zpe.thermalcorrgfe: 0.282635 hartree
zpe.sumelectzpe: -1357.733797 hartree
zpe.sumelectthermal: -1357.711479 hartree
zpe.sumelectthermalent: -1357.710535 hartree
zpe.sumelectthermalfe: -1357.788854 hartree
dipole: -1.7936 3.6023 -0.6070
dipole: 4.0697
quadrupole: -149.0068 -116.6124 -137.0065
quadrupole: 25.8046 -2.1007 -5.6913
quadrupole: -14.7982 17.5961 -2.7979 25.8046 -2.1007 -5.6913
hfenergy: -1358.0714895 hartree
pointgroup: C01[X(C17H20Cl1N3O1)]
dipole: 0.7110344 1.4269768 0.1475597 debye
polarizability: 371.7588428|35.0612293|227.6446746|-17.6972436|7.7201804|140.0469268 unknown
InChI: InChI=1S/C17H20ClN3O/c1-2-3-12-22-16-10-8-15(9-11-16)21-17(19)20-14-6-4-13(18)5-7-14/h4-11,21H,2-3,12,19H2,1H3
charge 0 multiplicity 1
42 atoms
Cl -7.345444 -2.544219 0.636533
O  4.524182 0.375884 -0.14989
N  -0.762227 2.420869 -0.195858
N  -2.193628 0.529704 -0.310284
N  -3.061549 2.755973 0.026152
C  6.319191 -1.245737 -0.123179
C  6.733084 -2.735554 -0.104323
C  4.798893 -1.07205 -0.130615
C  3.177547 0.781142 -0.161473
C  8.265873 -2.920711 -0.097973
C  0.528134 1.816028 -0.188746
C  2.960664 2.181345 -0.185515
C  2.065111 -0.094525 -0.154058
C  1.652336 2.690102 -0.196721
C  0.748201 0.416817 -0.172736
C  -2.023673 1.825762 -0.144415
C  -3.427676 -0.118677 -0.075819
C  -3.923135 -1.018577 -1.063874
C  -4.154649 0.003655 1.14951
C  -5.109345 -1.752224 -0.8547
C  -5.338454 -0.733209 1.36994
C  -5.806181 -1.595215 0.359674
H  6.736041 -0.726995 0.761419
H  6.742072 -0.747876 -1.016864
H  6.302962 -3.250467 -0.987639
H  6.298091 -3.229376 0.788588
H  4.349212 -1.548275 -1.027816
H  4.342563 -1.525687 0.774909
H  8.723836 -2.464552 -0.995553
H  8.719128 -2.441577 0.789972
H  8.542392 -3.990684 -0.083533
H  3.827173 2.84932 -0.192271
H  2.201982 -1.179772 -0.141118
H  1.501794 3.777947 -0.20788
H  -0.115696 -0.250115 -0.189492
H  -0.759016 3.432947 -0.331558
H  -3.357059 -1.134483 -1.993257
H  -3.768123 0.650534 1.94507
H  -5.481584 -2.437051 -1.622468
H  -5.881446 -0.64318 2.315837
H  -4.019829 2.420073 -0.041518
H  -2.904045 3.673382 0.436545
