program: Gaussian 09
title: 000250302
version: EM64L-G09RevD.01
frameworkgroup: C1[X(C8H14N4)]
method: RPBEPBE
basis: SDD
operation: Freq
keyword: #pfreq=noraman
keyword: PBEPBE/SDD
title: #p freq=noraman PBEPBE/SDD
converged: YES YES NO NO
title: Mulliken charges:
elementType: N N N N C C C C C C C C H H H H H H H H H H H H H H
charge: -0.132720 -0.156517 -0.623044 -0.622431 -0.413180 -0.409156 -0.505980 -0.428247 0.445996 -0.381315 -0.416966 0.243790 0.201109 0.200788 0.203074 0.203659 0.225493 0.215987 0.213605 0.212495 0.205074 0.227426 0.330137 0.305056 0.300121 0.355746
chargesum: 0.00000
title: Mulliken charges with hydrogens summed into heavy atoms:
elementType: N N N N C C C C C C C C
charge: -0.132720 -0.156517 0.012148 0.033436 -0.011283 -0.002423 -0.064500 -0.002147 0.445996 -0.176242 -0.189539 0.243790
polarizability: 2.42785770e+02 -2.46001531e+01 1.12855734e+02 -2.35250375e+00 8.25449056e-01 6.66022517e+01
1716.lowfreq: -6.8941 0.0005 0.0005 0.0006 1.9142 12.3503 49.0744 61.6397 74.3375
frequency: 49.0341 61.6241 74.3144 127.2345 176.5353 207.9937 240.4080 264.9041 278.6535 311.2232 350.6076 405.0442 428.5735 434.1765 453.0633 508.3472 524.8253 534.3440 622.9764 648.7846 686.5216 722.3526 775.9267 794.1788 834.3058 862.0136 911.0999 915.0523 939.3720 949.7809 968.1204 1005.3902 1049.5463 1066.6359 1075.9124 1103.3739 1120.7254 1129.1494 1168.2897 1204.6206 1234.1137 1262.2901 1305.1965 1325.6189 1336.0496 1344.4807 1348.0868 1388.6878 1450.1776 1456.9820 1468.4795 1473.1939 1490.7095 1514.2516 1576.4141 1589.5692 1626.6117 1642.0571 2938.7477 2970.3821 2975.3043 2975.9093 2996.4508 3024.8059 3030.7662 3036.3385 3046.0519 3089.6729 3475.9765 3547.1424 3666.1492 3696.8581
redmass: 3.5942 3.5747 4.1937 2.8581 2.7219 3.5074 1.4300 2.3983 3.2355 1.8826 2.5548 1.3776 4.0072 2.1306 2.3949 2.4705 1.5613 2.2452 2.8532 3.2052 2.7336 1.6269 3.2420 1.2799 1.5658 2.2187 1.7503 2.4894 2.7761 1.4877 2.9075 2.2809 1.6600 1.8587 1.8441 1.4386 2.4134 1.1718 1.6146 1.6761 1.3165 1.1788 1.3391 1.5713 1.3930 1.5295 1.7068 2.5384 1.1014 1.0809 1.0886 1.0936 2.4695 3.3159 2.8970 1.7832 1.5842 6.1583 1.0650 1.0657 1.0617 1.0677 1.0876 1.0880 1.0931 1.0995 1.1036 1.0896 1.0486 1.0449 1.0986 1.1036
irintensity: 3.7550 0.9823 2.1964 8.8355 4.3826 4.0752 137.8969 12.3989 5.3733 25.2348 36.5636 227.5104 11.0103 52.8931 10.8780 21.3884 133.0872 19.5612 7.2159 30.5860 8.9298 151.2930 5.8633 9.6759 4.5017 0.6770 12.9061 47.1997 12.7883 30.6545 7.0096 5.4240 8.6728 3.5132 1.6204 7.2927 56.1380 2.3935 0.1740 8.8099 5.0522 2.0288 2.2861 5.2551 2.8156 12.0706 1.5228 9.8988 3.6497 12.5347 10.3067 9.8871 29.8345 377.0718 54.7932 420.2164 645.9368 34.8659 52.6205 18.8352 33.4827 27.6858 66.0516 27.3718 27.2792 67.0256 77.6693 32.9833 36.1008 71.4775 60.7743 28.8823
temp: 298.150 k
press: 1.00000 atm
elementType: 7 7 7 7 6 6 6 6 6 6 6 6 1 1 1 1 1 1 1 1 1 1 1 1 1 1
symmnumber: 1
zpe: 575933.5 jmol-1
zpe.correction: 0.219361 hartree
zpe.thermalcorrener: 0.231783 hartree
zpe.thermalcorrenthalpy: 0.232727 hartree
zpe.thermalcorrgfe: 0.180624 hartree
zpe.sumelectzpe: -531.301981 hartree
zpe.sumelectthermal: -531.289560 hartree
zpe.sumelectthermalent: -531.288615 hartree
zpe.sumelectthermalfe: -531.340719 hartree
dipole: -2.2266 1.8361 0.0555
dipole: 2.8865
quadrupole: -43.3419 -66.3530 -76.3398
quadrupole: -6.5134 0.4799 1.2159
quadrupole: 18.6697 -4.3414 -14.3282 -6.5134 0.4799 1.2159
hfenergy: -531.5213426 hartree
pointgroup: C01 [X(C8H14N4)]
dipole: -0.8673826 -0.7327264 -0.0213705 debye
dipolederiv: 0.810354 0.1678867 0.0167549 -0.4591069 -0.3926575 -0.0130958 -0.0084719 -0.0112118 -0.1591684 -2.0938228 -0.3663692 -0.0271278 -0.345939 -0.4964314 -0.0073613 0.0306729 -0.0191836 -0.2767872 -1.8441198 0.1341413 -0.1722387 0.2933376 -0.3307183 -0.0843004 -0.4640747 -0.0946699 -0.6967266 -0.4636027 -0.0060731 0.1014126 -0.5655308 -1.2085431 0.1030862 0.1960857 0.2083613 -0.6098154 0.0505743 -0.0341124 0.0012922 -0.021212 0.0979725 0.0368829 0.0403892 0.0130067 0.1410485 0.0689635 -0.0289101 0.042174 -0.104006 0.0286465 -0.002065 0.007918 0.0191487 0.1303378 -0.0066971 -0.0129535 0.0034854 0.0263296 -0.0446148 -0.0039604 0.0216032 -0.0272449 0.1600596 -0.0838356 0.0329295 0.0117188 -0.0743327 -0.0005361 -0.0172297 -0.123303 -0.0442848 0.1959613 0.0323273 0.0206124 -0.0125915 -0.2195886 0.1436926 0.0190008 -0.0556931 0.0474411 -0.0547647 0.1517786 -0.0394904 -0.0027922 0.0161685 0.0415834 0.0114889 0.096351 0.0226114 -0.2646884 0.0869917 -0.0019295 0.0051072 -0.1254525 0.2251703 0.0180381 -0.0175769 0.01621 -0.0862397 2.631151 0.099898 0.0964797 1.1649724 1.4905289 -0.0197068 0.120573 0.0261151 0.2061302 0.0161495 -0.0019347 -0.0271875 -0.0450383 0.0755363 -0.0444502 -0.0439104 0.022962 -0.187623 0.0175653 0.0439582 0.0066229 0.1031231 -0.2164976 -0.025601 0.0239163 -0.0568961 0.069449 0.1032779 -0.0205781 -0.0562402 -0.0054091 0.0238638 -0.0142466 0.0258113 -0.0255611 -0.1861007 -0.257091 0.075954 -0.0152743 0.1033341 0.0320422 0.0034618 -0.0520777 0.0142432 0.073796 -0.030026 -0.0811981 0.0886871 -0.0506454 0.0117134 0.0488007 0.0773841 0.0739798 0.0164399 0.037539 0.0125931 -0.0410082 0.0110563 -0.0043913 -0.0546351 -0.0556103 -0.0810233 -0.1151935 -0.0854076 -0.0881391 0.0656529 -0.0266566 -0.0510391 0.0899794 0.1652194 0.1194523 0.0059262 -0.1252715 -0.0378348 -0.0828834 0.1001898 0.0765804 -0.030831 -0.1383912 -0.0794134 -0.1175911 0.0088092 0.0928873 0.0139568 0.0915601 -0.1502992 -0.0217513 0.0139093 -0.0161485 0.153105 0.0066623 0.0079767 -0.0039648 0.0512184 -0.1510671 -0.0137891 0.0089624 -0.0147579 0.1617531 0.2640347 -0.0440982 0.0252051 -0.0794234 0.1630662 0.0054021 0.068201 -0.0151334 0.377347 0.238692 -0.0141658 0.0361805 0.0334732 0.1585952 0.0639893 0.2419748 0.0764518 0.3668025 0.1752283 -0.0006194 -0.0628447 0.0027904 0.2031286 -0.0236643 -0.14535 -0.1148064 0.3718639 0.2897753 0.0895693 -0.0105766 0.1247877 0.2746752 -0.0234422 -0.0345124 -0.0596481 0.3246789 unknown
polarizability: 242.180719|26.1306459|113.4579615|2.5175051|0.784324|66.6050747 unknown
InChI: InChI=1S/C8H14N4/c9-8(10)12-11-6-7-4-2-1-3-5-7/h4,6H,1-3,5,9-10H2
charge 0 multiplicity 1
26 atoms
N  -1.227555 0.075689 -0.000943
N  -2.487329 0.735969 0.02069
N  -4.784699 0.325265 -0.103202
N  -3.302907 -1.529294 0.020943
C  2.888017 -1.463672 0.334562
C  3.894731 -0.540837 -0.389436
C  1.434183 -1.09381 -0.038229
C  3.681064 0.93195 0.035543
C  1.181201 0.408153 0.033033
C  2.215861 1.311306 0.076993
C  -0.195499 0.89914 0.048088
C  -3.488225 -0.160907 -0.01872
H  3.026763 -1.36047 1.429974
H  3.083647 -2.523758 0.0828
H  3.74566 -0.63233 -1.483985
H  4.935606 -0.850506 -0.175766
H  0.713446 -1.610556 0.622681
H  1.201811 -1.446973 -1.064047
H  4.223897 1.613926 -0.65055
H  4.131704 1.102378 1.03846
H  1.978479 2.383699 0.149241
H  -0.359024 1.990736 0.098355
H  -4.877404 1.338459 -0.13612
H  -5.576532 -0.233058 0.204435
H  -4.018665 -2.185047 -0.27865
H  -2.315232 -1.800453 0.038948
