program: Gaussian 09
title: 000250289
version: EM64L-G09RevD.01
frameworkgroup: C1[X(C19H22O4)]
method: RPBEPBE
basis: SDD
operation: Freq
keyword: #pfreq=noraman
keyword: PBEPBE/SDD
title: #p freq=noraman PBEPBE/SDD
converged: YES YES NO NO
title: Mulliken charges:
elementType: O O O O C C C C C C C C C C C C C C C C C C C H H H H H H H H H H H H H H H H H H H H H H
charge: -0.237082 -0.181362 -0.205064 -0.247496 -0.109980 -0.111867 -0.294984 0.121679 0.347690 -0.502533 -0.509832 -0.474712 0.569399 -0.660948 0.127142 -0.779465 -0.754741 -0.172455 -0.637446 -0.640817 0.199104 -0.410763 0.180802 0.233529 0.244978 0.274665 0.224204 0.226649 0.232939 0.236377 0.268379 0.213853 0.228881 0.241427 0.224979 0.251392 0.228598 0.250400 0.234499 0.241195 0.234777 0.291463 0.282284 0.264741 0.255523
chargesum: 0.00000
title: Mulliken charges with hydrogens summed into heavy atoms:
elementType: O O O O C C C C C C C C C C C C C C C C C C C
charge: -0.237082 -0.181362 -0.205064 -0.247496 0.123548 0.133111 -0.020319 0.121679 0.347690 -0.051680 -0.040516 0.007519 0.569399 -0.190640 0.127142 -0.074495 -0.028647 0.062321 -0.063699 -0.376076 0.199104 -0.155240 0.180802
polarizability: 2.77458582e+02 -2.83675627e+00 1.87739511e+02 -1.61303717e+01 -8.39778213e-01 1.64353509e+02
1716.lowfreq: -14.9967 -9.6476 -0.0009 -0.0004 0.0005 7.0142 29.6137 41.7277 51.7628
frequency: 29.5496 41.4207 51.6850 81.6114 98.3066 112.2756 140.2041 174.3841 184.1570 185.8686 211.5508 215.6027 227.5342 255.4034 258.7041 273.4520 292.4959 319.3295 341.2567 350.5048 371.6632 394.8865 401.0289 419.4197 437.0402 448.2915 470.2366 476.9745 480.1425 490.6529 512.3492 522.8303 558.7314 594.0485 616.2467 652.6130 667.6429 679.5697 695.2250 735.8622 778.7276 791.9487 808.2931 823.4365 834.7750 850.6340 881.2792 900.3454 906.9943 910.0542 922.2740 928.2152 937.7829 950.4628 967.5502 997.9782 1007.2183 1010.9938 1027.2817 1039.6580 1065.6851 1078.3961 1087.4882 1101.7493 1107.6689 1114.8294 1123.4449 1139.7716 1151.9924 1155.7393 1175.3123 1178.5963 1197.7769 1203.3548 1228.9319 1244.8545 1254.6039 1266.9402 1270.4482 1280.4698 1287.8115 1291.7375 1311.0987 1320.5416 1326.9238 1337.2222 1342.7177 1347.6836 1354.3026 1359.3827 1381.1996 1391.0689 1398.8940 1404.4755 1458.8320 1462.5653 1466.9824 1471.4876 1476.8344 1477.9670 1480.8209 1484.1128 1558.1794 1611.8994 1629.1954 1660.5984 1664.3715 2943.0608 2949.2296 2969.2522 2976.0687 2990.1181 2992.9538 2993.9538 2996.2220 2998.2491 3000.0243 3051.4339 3053.5742 3064.6298 3068.3128 3075.2851 3085.7940 3090.2059 3093.4826 3101.9769 3105.8839 3129.6566 3150.7239
redmass: 7.5049 4.3213 5.7250 3.8196 4.3946 4.3806 3.6813 3.7876 1.3936 3.1589 2.6008 1.1523 3.5058 3.3254 2.8727 3.1012 2.5777 3.2820 3.6745 3.9959 3.9738 3.7329 3.2664 3.9078 4.6438 2.5833 3.8016 3.8740 3.0674 3.7649 3.2375 3.2924 4.2084 4.8454 3.4912 4.4220 4.0684 3.5387 3.0523 3.4355 3.7501 3.2207 2.1540 1.6120 1.9447 2.7516 2.5667 2.5291 2.3733 1.9806 2.7411 1.9300 1.6752 2.0873 2.2465 1.3160 2.6906 1.8993 1.8725 3.0046 2.2017 2.5534 2.5896 2.4477 2.2684 1.8567 1.7368 1.9572 1.7009 1.9170 1.8367 2.0860 1.5861 1.5699 1.4447 1.5993 1.6639 1.6704 1.5265 1.4981 1.7495 1.7097 1.4768 1.3061 1.4643 1.3999 1.4550 1.5893 2.0317 1.4819 1.7675 1.3725 1.2061 1.0748 1.0645 1.0807 1.0689 1.0886 1.0606 1.0777 1.0676 1.0695 8.6666 8.5470 10.0068 7.5222 12.1988 1.0822 1.0803 1.0684 1.0644 1.0400 1.0687 1.0647 1.0463 1.0636 1.0561 1.0965 1.0985 1.1031 1.0943 1.0958 1.0995 1.0987 1.0996 1.0999 1.0859 1.0919 1.0974
irintensity: 3.8030 1.7047 3.3760 9.8460 0.5221 0.6699 2.2254 2.7112 1.1262 1.8494 1.4670 0.0252 1.0275 0.6546 0.1746 0.0953 0.0303 2.6555 3.1820 8.7809 8.0772 1.6695 3.8683 3.5209 2.2823 1.5909 2.4774 9.8609 2.3740 5.6796 3.6661 7.7812 2.3171 2.1909 3.4712 0.9157 3.6613 10.5685 7.0185 1.5173 18.4723 0.6239 3.9591 19.6393 4.4497 3.0513 2.3240 59.4702 16.5777 45.2060 21.3765 8.3283 2.9736 8.0651 11.8133 0.9082 6.8208 12.3658 8.8249 6.8498 4.3852 63.9925 35.9949 32.4672 3.7160 4.4150 45.6440 46.2124 9.5781 3.6846 64.5012 27.6573 3.0331 77.3936 2.6523 2.9134 93.8463 9.5746 16.3283 1.8578 5.2223 41.1502 8.2149 6.9034 7.8210 6.3479 4.1350 17.2558 4.1479 0.1436 23.5862 11.1493 34.7286 19.4487 3.0600 20.4215 10.0517 5.9018 3.8603 4.7881 9.9415 8.5474 182.0157 15.3249 225.6333 232.7961 239.6620 6.5719 6.5371 8.9461 19.9792 8.9667 1.0268 1.4113 5.3942 43.0016 44.7413 31.2916 22.4120 31.5108 0.8078 11.9689 17.6525 25.4413 25.4669 15.2868 16.4511 9.4903 14.1103
temp: 298.150 k
press: 1.00000 atm
elementType: 8 8 8 8 6 6 6 6 6 6 6 6 6 6 6 6 6 6 6 6 6 6 6 1 1 1 1 1 1 1 1 1 1 1 1 1 1 1 1 1 1 1 1 1 1
symmnumber: 1
zpe: 967860.9 jmol-1
zpe.correction: 0.368639 hartree
zpe.thermalcorrener: 0.389163 hartree
zpe.thermalcorrenthalpy: 0.390107 hartree
zpe.thermalcorrgfe: 0.320413 hartree
zpe.sumelectzpe: -1036.402121 hartree
zpe.sumelectthermal: -1036.381597 hartree
zpe.sumelectthermalent: -1036.380653 hartree
zpe.sumelectthermalfe: -1036.450347 hartree
dipole: -1.2323 -0.6607 3.7138
dipole: 3.9683
quadrupole: -198.0235 -132.7189 -140.3813
quadrupole: -8.3779 5.4748 -9.0616
quadrupole: -40.9822 24.3223 16.6599 -8.3779 5.4748 -9.0616
hfenergy: -1036.7707603 hartree
pointgroup: C01 [X(C19H22O4)]
dipole: 0.4746091 0.2516096 1.4659304 debye
polarizability: 277.2544992|-2.7398981|187.7145106|16.8532934|1.0103904|164.5825921 unknown
InChI: InChI=1S/C19H22O4/c1-18-7-5-12(20)9-11(18)3-4-13-14(18)6-8-19(2)17(13)15(21)10-16(22)23-19/h5,7,9,13-14,17H,3-4,6,8,10H2,1-2H3
charge 0 multiplicity 1
45 atoms
O  3.52816 1.256689 -0.643132
O  2.545931 -2.340995 1.024953
O  5.499424 0.492866 -1.503348
O  -5.717266 -0.108583 -1.65549
C  -0.677386 0.594422 0.075494
C  0.267181 -0.604068 0.412292
C  1.679352 -0.3684 -0.181647
C  -2.14883 0.36843 0.654408
C  2.307462 1.011686 0.219413
C  -0.047072 1.951605 0.483305
C  1.341946 2.144027 -0.165092
C  -0.325773 -1.932271 -0.121749
C  -2.645032 -0.984571 0.135039
C  -1.757107 -2.176067 0.42319
C  2.72508 -1.41692 0.190736
C  -2.155424 0.359481 2.223819
C  2.761187 1.094738 1.689549
C  -3.053027 1.512368 0.2281
C  4.075227 -1.208597 -0.489786
C  -3.791598 -1.111006 -0.602861
C  4.43878 0.226733 -0.909777
C  -4.194324 1.365291 -0.501611
C  -4.649205 0.033852 -0.971887
H  -0.796052 0.610489 -1.031351
H  0.373826 -0.696085 1.512233
H  1.604488 -0.344776 -1.292159
H  0.034054 2.026622 1.584689
H  -0.692669 2.785089 0.155241
H  1.243115 2.159035 -1.267351
H  1.78188 3.112225 0.135512
H  0.32448 -2.774621 0.167141
H  -0.362703 -1.894093 -1.230221
H  -1.691969 -2.359607 1.515039
H  -2.185149 -3.088052 -0.029557
H  -1.862357 1.346159 2.624217
H  -3.171262 0.135468 2.592831
H  -1.467775 -0.396895 2.638744
H  3.216417 2.081878 1.876185
H  1.908473 0.968294 2.378053
H  3.50734 0.32104 1.94171
H  -2.770599 2.510788 0.588402
H  4.884575 -1.613931 0.142951
H  4.094945 -1.810609 -1.421319
H  -4.118677 -2.092537 -0.968274
H  -4.829169 2.220013 -0.762837
