program: Gaussian 09
title: 000250279
version: EM64L-G09RevD.01
frameworkgroup: C1[X(C11H13NO)]
method: RPBEPBE
basis: SDD
operation: Freq
keyword: #p
keyword: freq=noraman
keyword: PBEPBE/SDD
title: #p freq=noraman PBEPBE/SDD
converged: YES YES NO NO
title: Mulliken charges:
elementType: O N C C C C C C C C C C C H H H H H H H H H H H H H
charge: -0.239572 -0.160394 -0.056934 -0.446048 -0.707648 0.055826 0.141771 0.331390 -0.329464 -0.406342 -0.781967 -0.254752 -0.223584 0.249149 0.235277 0.256498 0.221258 0.228853 0.228882 0.261265 0.233328 0.234613 0.207360 0.260873 0.231045 0.229316
chargesum: 0.00000
title: Mulliken charges with hydrogens summed into heavy atoms:
elementType: O N C C C C C C C C C C C
charge: -0.239572 -0.160394 0.192215 0.045727 -0.028655 0.055826 0.141771 0.331390 -0.068198 -0.173014 -0.079121 -0.023707 0.005732
polarizability: 1.63273296e+02 -4.24608546e+00 1.43723565e+02 8.53776730e+00 2.98679310e+00 7.49621567e+01
1716.lowfreq: -0.0008 -0.0007 -0.0004 1.6837 7.8948 9.9409 42.4496 68.4836 93.7078
frequency: 42.4027 68.4833 93.6989 125.4444 155.0113 170.6420 203.8516 224.1911 241.7153 313.4852 327.1796 381.2873 394.6201 430.1346 472.0961 504.0645 543.3529 605.7779 672.1031 693.9927 742.9867 764.0358 793.0444 805.7260 874.0819 881.3988 892.4606 948.4533 966.3181 994.0639 996.5952 1021.0005 1045.3382 1049.5259 1080.0259 1080.5860 1110.4778 1129.6346 1147.0809 1162.4741 1176.4259 1208.6475 1224.1922 1283.0522 1313.8332 1372.4204 1385.3346 1403.8947 1404.9604 1423.0818 1454.0963 1463.0052 1467.9321 1474.3738 1475.4667 1477.1757 1557.6231 1584.7963 1610.8568 2984.4892 2991.6247 3073.1466 3075.8652 3076.9891 3079.7331 3089.8236 3099.7173 3121.9987 3135.9314 3152.6568 3168.7655 3178.3445
redmass: 3.8299 3.6669 3.5652 3.7237 1.1738 1.9701 1.2539 3.8498 3.3299 3.7711 4.4519 3.3656 2.6416 3.2890 3.3239 3.6103 5.3771 5.1290 5.2788 5.2016 1.7368 2.5760 3.2267 2.5781 3.2057 1.2978 1.2868 3.2956 1.4540 1.5962 1.3478 1.2662 1.5979 2.1799 1.8596 1.6816 1.4735 1.5365 1.7885 2.0331 1.0711 2.8608 2.4794 1.4559 2.2066 7.0278 1.3856 1.5538 1.4578 1.8817 1.0686 1.0477 1.2124 1.2366 1.0600 2.2646 8.6694 6.8136 6.2992 1.0359 1.0364 1.0604 1.0953 1.0877 1.0962 1.1010 1.0982 1.0859 1.0900 1.0948 1.0984 1.1172
irintensity: 1.2607 1.9413 1.4955 3.2072 0.7079 2.6321 0.7120 2.8316 2.8170 1.5376 18.2885 3.4366 1.6812 2.4441 6.7387 2.0117 0.8170 3.3883 6.3151 11.2059 53.2085 8.5645 11.8709 17.9327 6.8509 1.8428 3.7878 59.2203 1.8527 0.7082 0.4579 6.7299 9.9827 8.7001 24.2290 1.7228 16.0320 4.7035 30.6960 6.0018 1.0670 20.9539 67.6996 2.2258 227.9322 11.6203 44.0496 135.8184 47.8913 2.9740 14.7492 14.1764 35.7346 24.0507 8.8436 6.5090 141.8348 55.2392 31.3442 20.4843 23.2945 16.1053 44.5276 2.4059 12.9378 25.0598 33.7192 4.4980 16.2017 28.5916 15.7217 12.6099
temp: 298.150 k
press: 1.00000 atm
elementType: 8 7 6 6 6 6 6 6 6 6 6 6 6 1 1 1 1 1 1 1 1 1 1 1 1 1
symmnumber: 1
zpe: 557095.5 jmol-1
zpe.correction: 0.212186 hartree
zpe.thermalcorrener: 0.224759 hartree
zpe.thermalcorrenthalpy: 0.225703 hartree
zpe.thermalcorrgfe: 0.173094 hartree
zpe.sumelectzpe: -555.958683 hartree
zpe.sumelectthermal: -555.946110 hartree
zpe.sumelectthermalent: -555.945166 hartree
zpe.sumelectthermalfe: -555.997775 hartree
dipole: -0.8287 -2.8636 2.0920
dipole: 3.6419
quadrupole: -63.5284 -78.4361 -79.6077
quadrupole: 1.7818 -0.6448 4.0433
quadrupole: 10.3290 -4.5787 -5.7503 1.7818 -0.6448 4.0433
hfenergy: -556.1708694 hartree
pointgroup: C01 [X(C11H13N1O1)]
dipole: 0.3378303 -0.921796 -1.0436091 debye
dipolederiv: -0.734204 -0.0541469 -0.0392332 0.2146174 -0.9305936 -0.3204335 0.1065111 -0.2585804 -0.4438627 -1.5786886 0.3985674 0.3329569 0.7164701 -0.5900107 -0.0271134 0.1810865 0.0957742 -0.2801191 0.4374364 -0.1560466 -0.1434803 -0.292369 0.3922058 0.0228861 -0.2670392 0.0076081 0.233739 0.2507752 -0.0283938 0.0331759 -0.0275441 0.0658422 -0.1299267 -0.0025547 -0.1229181 0.1191762 0.0368998 0.0396562 -0.0148517 0.0965335 -0.117317 -0.0194966 0.0604139 -0.0389193 0.0173451 1.9972907 -0.1467836 0.0139114 -0.455627 1.0937965 0.4648996 0.0990152 0.2802285 0.2813116 -0.4564092 -0.0991314 -0.0820383 -0.2035493 -0.227043 -0.1098157 -0.0874099 -0.0517124 -0.0676862 0.074045 0.1035296 0.0251758 -0.1669522 0.4074795 -0.0127797 -0.0399333 0.0603138 -0.0087793 0.0114232 -0.0338339 0.0604263 0.1566815 0.006734 0.0497272 0.1387854 0.0095519 -0.0774758 0.0412279 -0.1954576 0.0793967 -0.0767448 -0.2370799 -0.0283097 0.0804518 -0.0720769 -0.1459939 0.1196929 -0.0796022 0.0459298 0.0325487 -0.2238923 -0.0247989 0.0552357 -0.0917071 0.0450668 -0.2581652 0.0141334 -0.0078027 0.0129018 0.0943283 -0.0066574 -0.0356013 0.0037109 -0.1771553 0.0988978 0.0283911 0.0911436 -0.0159734 0.0851506 0.0080083 0.0835336 0.011738 -0.094589 0.0319451 0.0884642 -0.0560093 0.0503837 -0.0132926 0.0568424 0.021971 0.0126951 -0.0949611 -0.0768073 0.0070328 -0.0830377 0.0065881 0.0624111 0.054581 -0.1294956 0.0263844 0.0385138 0.0243984 0.025027 -0.0305596 -0.0845145 -0.0685782 0.050629 0.0434633 0.0225057 0.0862162 -0.0817904 0.0522279 0.1302837 0.0226385 0.065624 -0.0115691 0.1366701 -0.0228016 0.0092482 0.0994184 0.019143 -0.045116 0.0042461 0.0628078 0.0217423 -0.0824237 0.0872036 -0.0835835 -0.0138833 -0.1216225 -0.0657197 -0.0716507 -0.0235682 -0.0670269 -0.0774319 -0.0309289 0.0758114 0.0200312 0.0882032 -0.0580336 0.0912674 0.0529787 0.0114144 -0.0681635 0.0099168 0.1128758 -0.0557875 0.072198 -0.0658444 0.1103122 0.0195074 0.0387874 -0.0734427 0.0274129 0.1265335 -0.0243976 -0.0699554 0.0946528 -0.0367415 0.0293141 0.0328968 0.0774544 0.0556044 0.0504304 -0.1260089 0.1302547 -0.1020415 0.0140726 0.0505534 0.0107148 -0.1155384 0.0757881 0.0513225 0.1299864 0.004696 -0.0156701 0.0156046 0.0379907 -0.0308258 0.0074347 -0.0611688 -0.0470925 0.0885896 0.007084 -0.0241503 -0.0230016 -0.1280958 -0.0023695 -0.0357154 0.0020497 0.1478061 -0.0559161 -0.0936348 -0.0734646 -0.0901981 0.0327471 -0.0320065 -0.0772774 -0.0376726 0.1259016 unknown
polarizability: 161.5354845|-0.3627892|141.0849104|16.3141702|12.4055466|79.3386223 unknown
InChI: InChI=1S/C11H13NO/c1-8-5-3-4-6-10(8)11(13)12-7-9(12)2/h3-6,9H,7H2,1-2H3
charge 0 multiplicity 1
26 atoms
O  0.715614 2.020328 1.366468
N  1.888469 0.077373 0.819965
C  2.664244 -0.350604 -0.390042
C  3.235273 0.655374 0.622064
C  3.148232 -1.785637 -0.468427
C  0.702927 0.848045 0.880495
C  -0.536608 0.140584 0.411044
C  -1.703213 0.872892 0.014062
C  -0.548499 -1.281714 0.381795
C  -2.833414 0.131593 -0.418746
C  -1.78327 2.388517 0.034544
C  -1.687778 -1.994087 -0.039579
C  -2.837381 -1.280006 -0.447403
H  2.319216 0.083889 -1.339864
H  4.006254 0.320812 1.324978
H  3.281943 1.71604 0.346183
H  4.009534 -1.86378 -1.157067
H  3.461935 -2.146267 0.526565
H  2.349763 -2.451752 -0.843524
H  0.340779 -1.818142 0.726729
H  -3.72914 0.679551 -0.73451
H  -0.921023 2.856523 -0.471764
H  -2.713236 2.730822 -0.452253
H  -1.757418 2.769974 1.069798
H  -1.684065 -3.089435 -0.041631
H  -3.733137 -1.816994 -0.779581
