program: Gaussian 09
title: 000250276
version: EM64L-G09RevD.01
frameworkgroup: C1[X(C10H11NO)]
method: RPBEPBE
basis: SDD
operation: Freq
keyword: #p
keyword: freq=noraman
keyword: PBEPBE/SDD
title: #p freq=noraman PBEPBE/SDD
converged: YES YES NO NO
title: Mulliken charges:
elementType: O N C C C C C C C C C C H H H H H H H H H H H
charge: -0.246171 -0.143652 -0.396761 -0.420954 0.081175 0.272084 -0.322259 -0.353169 0.448700 -0.421258 -0.354941 -0.804832 0.259155 0.242456 0.240089 0.245142 0.245795 0.270750 0.232033 0.232869 0.237388 0.225377 0.230984
chargesum: 0.00000
title: Mulliken charges with hydrogens summed into heavy atoms:
elementType: O N C C C C C C C C C C
charge: -0.246171 -0.143652 0.104850 0.064277 0.081175 0.272084 -0.076464 -0.082419 0.448700 -0.189225 -0.122072 -0.111082
polarizability: 1.74166716e+02 1.17010448e-01 1.17931561e+02 -4.92448697e+00 5.60897113e+00 6.33119512e+01
1716.lowfreq: -19.0274 -9.8578 -2.2519 -0.0004 0.0005 0.0005 4.8938 53.2444 74.1134
frequency: -17.6008 53.2223 74.0939 117.0176 129.0509 178.9957 242.5895 286.2458 327.3429 338.6688 406.8842 444.4477 484.6632 576.2934 629.6960 646.6290 684.4653 745.1763 785.9484 802.5373 840.2565 859.3382 864.1139 915.8354 971.6060 983.3799 993.5203 1001.6299 1010.5760 1039.6030 1047.3891 1096.9039 1109.2029 1118.4214 1122.5264 1141.6247 1185.8887 1223.0208 1227.6429 1305.9293 1367.0672 1372.9573 1396.2018 1408.6177 1463.6021 1468.7953 1472.2974 1480.1367 1503.0706 1556.8987 1590.7101 1620.5472 2977.7186 3056.9035 3071.8102 3083.1953 3086.5993 3123.5359 3126.0524 3157.6620 3161.7407 3174.5126 3192.9572
redmass: 1.0319 4.0679 3.1785 4.3456 3.2035 3.8234 3.7919 4.2092 4.4251 3.4681 2.8487 4.8745 2.9598 5.5002 6.5948 5.9926 4.3566 2.8265 4.7824 1.0431 1.7109 1.7925 2.1043 5.2425 1.3620 1.4391 1.3687 1.1346 3.1518 2.6307 1.5798 1.2774 1.3496 1.4521 1.3927 1.4398 1.1564 3.3650 3.0910 1.2824 4.7389 4.9346 1.2546 3.5964 1.0752 1.0549 1.1018 1.2257 2.6692 8.2702 7.5510 6.3107 1.0375 1.0967 1.0498 1.0580 1.0991 1.0892 1.0892 1.0944 1.0957 1.1189 1.1177
irintensity: 0.7736 2.1411 2.3755 2.2526 0.4948 10.4798 7.8639 3.6461 0.3347 4.8109 0.0650 4.3763 16.8684 6.9810 2.2056 1.6126 14.2485 19.6710 1.3794 17.2275 24.4528 0.6150 21.9285 2.4496 3.2796 0.3026 2.0089 3.7617 26.8407 61.7277 15.4400 1.0280 12.1896 37.1878 0.7113 3.4978 41.0773 3.9017 49.4884 2.5372 382.3311 35.4364 13.2750 20.8283 4.5462 13.4019 8.8414 22.2162 9.0584 142.2201 70.3447 48.2040 29.9483 19.3652 21.2501 34.5220 18.3545 15.9906 17.1354 14.0427 2.6221 3.5970 23.1051
temp: 298.150 k
press: 1.00000 atm
elementType: 8 7 6 6 6 6 6 6 6 6 6 6 1 1 1 1 1 1 1 1 1 1 1
symmnumber: 1
zpe: 484044.8 jmol-1
zpe.correction: 0.184363 hartree
zpe.thermalcorrener: 0.194858 hartree
zpe.thermalcorrenthalpy: 0.195802 hartree
zpe.thermalcorrgfe: 0.147581 hartree
zpe.sumelectzpe: -516.731381 hartree
zpe.sumelectthermal: -516.720886 hartree
zpe.sumelectthermalent: -516.719942 hartree
zpe.sumelectthermalfe: -516.768163 hartree
dipole: -1.3014 -3.4341 1.6139
dipole: 4.0114
quadrupole: -57.2095 -70.9432 -72.8403
quadrupole: -8.2351 2.6765 2.3634
quadrupole: 9.7882 -3.9455 -5.8426 -8.2351 2.6765 2.3634
hfenergy: -516.9157435 hartree
pointgroup: C01 [X(C10H11N1O1)]
dipole: -0.4256242 -1.1397361 1.0052609 debye
dipolederiv: -0.7851568 -0.1944688 0.0780772 0.0136825 -0.9384444 0.2668296 -0.0102477 0.2102428 -0.41732 -1.1722321 0.4951694 -0.3587509 0.9062746 -0.8278655 0.1200815 -0.189794 -0.0977242 -0.3316678 0.2467725 -0.0646283 0.0083702 -0.1185971 0.1457205 0.1056561 0.0342165 0.1055044 0.1719501 0.1495309 -0.1083931 0.1353885 -0.236337 0.3330889 0.0143798 0.1811317 0.0361869 0.1992403 1.9626485 -0.1593654 -0.0326823 -0.5154169 1.2854452 -0.3994206 -0.0989712 -0.2113339 0.2387963 -0.6653707 -0.0703275 0.0736917 -0.101773 -0.099665 0.0584586 0.0665259 0.0326487 -0.0359988 0.1190957 -0.0333601 -0.0526683 0.1272016 0.0232653 -0.016484 -0.1077408 0.0020809 -0.0935502 0.1099011 0.079671 -0.045986 -0.1070533 0.0461126 0.005321 -0.0053854 -0.0310189 -0.1034998 0.5094308 0.0702772 -0.0841889 0.0387631 0.031484 -0.0031829 -0.0539842 -0.0058125 -0.0044479 -0.357212 0.0432791 0.018937 0.189241 0.0984011 -0.0296598 0.0290004 -0.012585 -0.178618 -0.1973272 -0.1684588 -0.0037965 -0.2952713 0.0018745 0.0370762 0.0144102 0.0195752 -0.1796491 -0.2336984 -0.0352618 0.0418112 0.0629401 0.0930121 -0.0122951 -0.0232808 -0.0034454 0.0625361 -0.0012546 0.0037564 0.0053917 -0.0867288 -0.020563 -0.088828 -0.0616644 -0.0366388 0.0790223 -0.0842135 0.0415821 0.0648201 0.022574 0.0650377 -0.0586029 0.1134842 -0.060692 0.0477221 0.1297992 -0.034156 0.0119897 0.0514497 -0.1292879 0.0398921 -0.0142398 0.004097 0.0414806 0.084936 0.0508687 0.0603194 0.0219568 0.0251592 -0.0510437 -0.0002275 0.022886 -0.0956172 0.0427309 0.0979808 0.0263781 0.1035161 0.0034471 -0.0069038 0.0313484 -0.0008369 0.1323296 0.1163463 -0.0651475 0.0134695 -0.0293676 -0.0046393 0.0047797 -0.0044945 0.0219104 0.1497232 0.0391285 -0.0769932 0.0203952 -0.0857834 -0.09129 0.0162162 0.0299621 0.0195099 0.1456905 -0.0299366 0.1080251 0.0256747 0.1079158 -0.0198296 -0.0128977 0.030283 -0.0172631 0.1436208 -0.0606527 0.0020592 -0.066926 0.0041528 0.0881891 0.0659022 -0.1159024 0.044197 -0.03483 0.0622414 0.0136093 0.0064012 -0.0993226 -0.1316612 0.0597726 0.0350545 0.036825 0.0964109 0.0144927 0.004282 0.0538836 0.0259831 0.0230085 -0.1150473 0.1205157 -0.0783133 -0.0333242 unknown
polarizability: 172.9220059|-1.1607581|116.9218701|-12.6183484|-9.1902224|65.5663526 unknown
InChI: InChI=1S/C10H11NO/c1-8-2-4-9(5-3-8)10(12)11-6-7-11/h2-5H,6-7H2,1H3
charge 0 multiplicity 1
23 atoms
O  1.862504 1.789778 -1.039788
N  2.395215 -0.435331 -0.570835
C  3.811228 -0.298687 -0.178002
C  2.849274 -1.171343 0.642986
C  1.482547 0.637654 -0.669389
C  0.049124 0.304193 -0.386955
C  -0.419339 -1.028561 -0.262076
C  -0.874918 1.373716 -0.25407
C  -2.71149 -0.218107 0.14311
C  -1.782575 -1.28112 -0.000318
C  -2.232104 1.113983 0.010808
C  -4.180948 -0.489341 0.409895
H  4.117885 0.669319 0.235556
H  4.539969 -0.778806 -0.838622
H  2.901318 -2.262208 0.558161
H  2.525427 -0.790921 1.619642
H  0.27642 -1.862942 -0.396195
H  -0.501736 2.396923 -0.368321
H  -2.134365 -2.316079 0.086357
H  -2.934463 1.950101 0.114995
H  -4.800541 -0.218977 -0.466671
H  -4.364203 -1.55434 0.632625
H  -4.552026 0.106897 1.263804
