program: Gaussian 09
title: 000018065
version: EM64L-G09RevD.01
frameworkgroup: C1[X(C3H9O2PS2)]
method: RPBEPBE
basis: SDD
operation: Freq
keyword: #p
keyword: freq=noraman
keyword: PBEPBE/SDD
title: #p freq=noraman PBEPBE/SDD
converged: NO YES NO NO
title: Mulliken charges:
elementType: S S P O O C C C H H H H H H H H H
charge: 0.020697 -0.234768 0.618607 -0.458052 -0.457938 -0.813516 -0.482553 -0.482417 0.285555 0.259202 0.286407 0.248483 0.232604 0.248289 0.232530 0.248657 0.248214
chargesum: 0.00000
title: Mulliken charges with hydrogens summed into heavy atoms:
elementType: S S P O O C C C
charge: 0.020697 -0.234768 0.618607 -0.458052 -0.457938 0.017648 0.246823 0.246985
polarizability: 1.31179951e+02 -2.84381339e-01 8.97873957e+01 -8.29831951e+00 1.28997278e-01 8.54907210e+01
1716.lowfreq: -32.9828 -14.9743 -0.0016 -0.0015 0.0018 9.9250 25.8026 38.4737 51.5645
frequency: 20.9821 35.4925 51.5586 81.4600 101.5758 107.9925 117.6147 141.7876 147.8820 197.6187 207.7194 279.0385 342.9326 364.1568 374.6609 533.0135 634.8220 658.7906 685.8119 952.9869 970.1034 983.8217 984.2538 1109.0442 1112.7148 1122.0276 1131.1672 1340.9575 1420.1050 1423.1737 1435.2168 1451.1105 1452.0343 1460.4342 1468.7099 1470.9761 2978.4157 2979.1505 3021.5113 3078.6106 3079.2304 3130.8580 3131.1768 3143.3699 3158.3558
redmass: 3.8530 1.0318 2.8036 3.2549 1.3499 1.3625 2.0524 3.0821 4.9608 5.6970 6.1755 8.7280 4.7829 5.4170 14.2067 17.7591 7.4434 11.6497 12.5847 10.4590 1.2200 1.2116 8.5727 1.2468 1.2485 1.2980 1.3094 1.1212 1.1190 1.1175 1.0518 1.0492 1.0483 1.0551 1.0525 1.0530 1.0306 1.0307 1.0282 1.1048 1.1048 1.1022 1.1022 1.1035 1.1060
irintensity: 0.1024 0.1763 8.1623 1.4913 1.1106 1.3010 1.4080 3.9783 11.2440 2.7001 2.0308 7.9567 5.3315 0.1702 38.6157 132.2300 5.9715 71.8890 116.9376 273.0701 17.7416 11.9383 11.1435 0.3304 0.0508 2.1490 0.1107 1.4455 3.3589 4.5470 14.9344 2.2104 25.7559 24.0256 13.1177 18.7911 85.7182 2.7970 15.4022 2.4684 43.2274 7.4709 11.5385 2.0820 7.7744
temp: 298.150 k
press: 1.00000 atm
elementType: 16 16 15 8 8 6 6 6 1 1 1 1 1 1 1 1 1
symmnumber: 1
zpe: 323436.9 jmol-1
zpe.correction: 0.123191 hartree
zpe.thermalcorrener: 0.136362 hartree
zpe.thermalcorrenthalpy: 0.137306 hartree
zpe.thermalcorrgfe: 0.080714 hartree
zpe.sumelectzpe: -1406.825062 hartree
zpe.sumelectthermal: -1406.811891 hartree
zpe.sumelectthermalent: -1406.810947 hartree
zpe.sumelectthermalfe: -1406.867539 hartree
dipole: 2.3499 -0.0291 -1.1320
dipole: 2.6085
quadrupole: -70.3974 -57.3823 -79.4392
quadrupole: 0.1343 1.1291 -0.0376
quadrupole: -1.3244 11.6906 -10.3662 0.1343 1.1291 -0.0376
hfenergy: -1406.9482531 hartree
pointgroup: C01 [X(C3H9O2P1S2)]
dipole: 0.27714 -0.8577732 0.4905393 debye
dipolederiv: -0.3166429 0.0971204 0.030669 0.09915 -0.5986412 -0.0944244 0.0330759 -0.1051228 -0.2444223 -0.4333749 0.0990205 -0.0424013 0.0987056 -0.7130144 0.1334904 -0.0453676 0.1430831 -0.424586 1.5761264 -0.115603 0.0216056 -0.1173648 1.9113919 -0.0709092 -0.0623597 0.1971008 1.3043417 -1.2282701 -0.0667551 0.2032995 -0.1935899 -0.5921275 0.0955711 0.3194627 -0.0126799 -0.6016385 -1.1471388 -0.3211366 -0.2156289 -0.1947449 -0.6810473 -0.0361364 -0.2506498 -0.1904539 -0.5958183 0.0390234 0.0168679 0.0227589 0.019792 -0.0220309 -0.0671358 0.060651 -0.1809844 0.0490261 0.7633502 0.1168943 -0.1576536 0.0399223 0.2260405 0.0253781 0.2097665 0.0432717 0.1308191 0.6609024 0.1871285 0.1079098 0.2664046 0.3300251 0.1086848 -0.2029251 -0.0871245 0.1316294 0.0003129 -0.0302353 -0.0716845 -0.0583434 0.0739672 -0.0056955 -0.1006841 0.0524808 0.0115351 0.1177444 0.0666425 0.0079565 0.0652609 -0.077896 -0.0327909 -0.0066075 0.0124053 0.0650535 -0.0119727 -0.0273315 0.0630707 -0.0023472 0.0970193 0.0331436 0.0532736 0.0975721 0.0076383 -0.0149339 -0.0341178 0.0814281 -0.0579181 0.102925 0.0593875 0.0776542 0.0512707 -0.0153123 0.0044526 -0.0037178 0.0249535 -0.0401907 -0.0208012 -0.1038076 -0.1055686 -0.1205311 -0.006178 0.0012932 0.0089141 0.0061257 0.1045054 -0.0592713 0.0308896 -0.0974609 0.0464584 0.1047989 -0.0256919 0.0011438 0.0402266 0.0377714 0.0068992 -0.0996223 0.1558512 -0.0383413 -0.0058811 -0.0203257 -0.0532087 -0.1000361 -0.0294369 0.1072832 -0.0000869 -0.0922405 -0.0040187 -0.0146602 0.0351454 0.0583739 -0.0225994 -0.0375763 -0.0907216 0.0240638 0.0541285 0.0956136 0.103655 unknown
polarizability: 93.4519355|-11.6147614|126.583698|3.2141582|-10.0134306|86.4224339 unknown
InChI: InChI=1S/C2H6O2PS.CH3S/c1-3-5(6)4-2;1-2/h1-2H3;1H3
charge 0 multiplicity 1
17 atoms
S  0.481916 -1.480574 -1.47262
S  -0.616653 2.009624 -1.386114
P  -0.092038 0.372163 -0.247114
O  -1.21899 -0.235995 0.927303
O  1.191477 0.527192 0.912746
C  0.862058 -2.648236 -0.0282
C  -2.634249 -0.334879 0.505565
C  2.401546 1.26096 0.478928
H  1.695207 -2.248145 0.565768
H  1.141997 -3.606809 -0.493415
H  -0.032126 -2.769189 0.59889
H  -3.162989 -0.674441 1.408159
H  -2.752809 -1.073284 -0.309263
H  -3.017359 0.649333 0.181462
H  2.923349 0.719177 -0.331921
H  3.032271 1.299172 1.379078
H  2.144191 2.282232 0.145248
