program: Gaussian 09
title: 000250275
version: EM64L-G09RevD.01
frameworkgroup: C1[X(C6H2Cl2F3N3O)]
method: RPBEPBE
basis: SDD
operation: Freq
keyword: #p
keyword: freq=noraman
keyword: PBEPBE/SDD
title: #p freq=noraman PBEPBE/SDD
converged: YES YES NO NO
title: Mulliken charges:
elementType: Cl Cl F F F O N N N C C C C C C H H
charge: 0.025539 0.066860 -0.134788 -0.175769 -0.125085 -0.143239 -0.443270 0.083652 0.077451 0.556984 0.143888 -0.298240 -0.257232 0.318966 -0.332086 0.363686 0.272685
chargesum: 0.00000
title: Mulliken charges with hydrogens summed into heavy atoms:
elementType: Cl Cl F F F O N N N C C C C C C
charge: 0.025539 0.066860 -0.134788 -0.175769 -0.125085 -0.143239 -0.079584 0.083652 0.077451 0.556984 0.143888 -0.298240 -0.257232 0.318966 -0.059402
polarizability: 1.39040902e+02 -4.35173958e+00 1.29993981e+02 -3.57646293e+00 -2.74511544e+00 5.98934801e+01
1716.lowfreq: -7.2276 -2.3670 0.0025 0.0025 0.0033 2.8845 14.1049 40.3119 53.5991
frequency: 13.4734 40.2870 53.5896 75.5867 113.4960 161.4529 190.7635 211.0126 220.0536 274.3341 286.2496 320.5974 375.1281 376.8840 392.0614 438.6969 478.1215 502.8980 543.8585 570.2573 613.3973 628.8758 668.6789 706.0989 746.1674 759.0807 789.0279 866.2128 924.5645 1009.3243 1046.4417 1059.0330 1117.0747 1159.0501 1186.3934 1221.5361 1258.9663 1366.7449 1386.1976 1439.5273 1503.0452 1533.2661 1665.4398 3198.9835 3481.1600
redmass: 19.2377 15.9346 13.0792 9.7029 16.5791 21.5998 14.7747 12.2533 15.1245 11.5208 14.1616 5.7770 17.9535 14.8786 14.9938 16.4498 7.0650 11.1092 3.7954 11.6206 11.4633 1.4633 10.2495 11.4814 8.8991 9.0667 11.0310 9.9149 1.4555 11.7376 10.9171 11.1629 8.9770 8.3171 3.7117 4.0955 9.8085 2.7078 1.9629 6.0881 1.9114 11.7802 9.7200 1.0940 1.0767
irintensity: 0.1762 0.4080 0.3140 3.9642 0.8027 1.2478 0.1356 4.2877 5.2198 0.2617 1.9537 2.1191 12.7941 1.7955 8.9462 3.1646 1.3471 4.7754 0.6558 0.4788 14.9674 84.7426 13.2075 13.3062 45.8740 77.5729 62.8583 66.0242 11.3134 155.1000 198.2650 143.2308 66.2435 47.7716 35.3832 33.9709 6.6834 158.6645 107.8488 306.3056 256.4010 22.5516 204.9182 3.4115 76.7047
temp: 298.150 k
press: 1.00000 atm
elementType: 17 17 9 9 9 8 7 7 7 6 6 6 6 6 6 1 1
symmnumber: 1
zpe: 221148.2 jmol-1
zpe.correction: 0.084231 hartree
zpe.thermalcorrener: 0.097933 hartree
zpe.thermalcorrenthalpy: 0.098877 hartree
zpe.thermalcorrgfe: 0.040602 hartree
zpe.sumelectzpe: -1687.854851 hartree
zpe.sumelectthermal: -1687.841149 hartree
zpe.sumelectthermalent: -1687.840205 hartree
zpe.sumelectthermalfe: -1687.898479 hartree
dipole: -1.8219 1.5379 -1.8910
dipole: 3.0431
quadrupole: -101.9878 -104.6434 -99.2635
quadrupole: 2.9741 -2.5216 1.0886
quadrupole: -0.0229 -2.6785 2.7014 2.9741 -2.5216 1.0886
hfenergy: -1687.9390816 hartree
pointgroup: C01 [X(C6H2Cl2F3N3O1)]
dipole: -0.7106112 -0.8800024 0.3924216 debye
dipolederiv: -0.1731143 0.2641063 0.0922128 0.1831722 -0.6903764 -0.2539244 0.0523863 -0.2147934 -0.1380149 -0.2217292 -0.2431254 -0.2360418 -0.2078875 -0.3561717 -0.2828791 -0.1886273 -0.3039905 -0.2632248 -0.5812744 -0.08276 -0.2063892 -0.0643412 -0.3540338 -0.1609612 -0.2134172 -0.1758467 -0.5706926 -0.5139283 0.0599531 -0.0206163 0.039845 -0.785204 0.1416308 -0.0123762 0.1287377 -0.3163962 -0.6309058 -0.0176565 0.2724874 0.0128619 -0.2468456 0.0247089 0.2406659 0.0503148 -0.5979682 -0.4889272 0.0564286 -0.0585607 -0.453042 -0.6523871 0.2953739 0.1890627 0.2241588 -0.3799929 -1.3844278 -0.2464769 0.1600068 -0.2594875 -0.442601 0.1118985 0.1431498 0.1426722 -0.4336965 -0.7707683 0.408541 0.055438 0.1522791 -0.6020177 -0.1938456 -0.0873359 -0.0961673 -0.1964006 -0.7934022 -0.2233199 -0.3165375 0.0537752 -0.3987311 -0.133516 -0.1620038 -0.2118028 -0.2909425 0.7514596 -0.0225502 -0.105531 -0.2930167 -0.6256475 -0.3186796 -0.0124655 -0.341268 -0.0249637 1.1051711 0.201155 -0.1269091 0.8917969 0.8723704 -0.5515681 -0.246011 -0.4083943 0.3782268 0.5440335 -0.3869933 -0.0076869 -0.3307637 1.2743487 0.4702482 0.0097959 0.4265466 0.2275698 0.6685695 0.2359808 0.4225153 0.3420596 0.8206137 0.5717364 0.298182 0.5386318 0.4928422 1.6227111 0.0903349 -0.0698582 0.0448351 1.3363243 0.0423587 -0.0767258 0.0523915 1.4967789 0.6181006 -0.0817986 0.134976 -0.0928065 0.5284205 0.2372899 0.1266956 0.2341947 0.1488332 0.2485307 -0.0346947 0.0345812 -0.0343199 0.2347886 0.0198605 -0.0514348 -0.0280337 0.3434777 -0.0000987 0.0228757 -0.0240867 0.0150401 0.0871497 -0.0197319 -0.0095406 -0.0173515 0.1245644 unknown
polarizability: 138.5344156|2.0026771|119.5694209|6.8250549|25.4031186|70.8245273 unknown
InChI: InChI=1S/C6H2Cl2F3N3O/c7-3-2(4(8)13-1-12-3)14-5(15)6(9,10)11/h1,14H
charge 0 multiplicity 1
17 atoms
Cl -1.235619 -2.698238 -1.054154
Cl -0.615493 2.172488 1.599144
F  3.469074 0.451043 1.138076
F  2.810187 -1.591734 0.38396
F  3.682449 -0.064702 -1.058288
O  1.295373 1.49772 -0.756395
N  0.42189 -0.473614 0.209746
N  -3.181627 -0.85483 -0.636388
N  -2.88069 1.279707 0.45354
C  -0.955667 -0.17448 0.104878
C  1.435053 0.379954 -0.217566
C  -1.87333 -1.090356 -0.486763
C  -1.573211 1.005984 0.617421
C  2.854022 -0.200703 0.05659
C  -3.639174 0.34941 -0.185291
H  0.679497 -1.439398 0.445446
H  -4.696034 0.576147 -0.339155
