program: Gaussian 09
title: 000254241
version: EM64L-G09RevD.01
frameworkgroup: C1[X(C15H20NO5P)]
method: RPBEPBE
basis: SDD
operation: Freq
keyword: #p
keyword: freq=noraman
keyword: PBEPBE/SDD
title: #p freq=noraman PBEPBE/SDD
converged: YES YES NO NO
title: Mulliken charges:
elementType: P O O O O O N C C C C C C C C C C C C C C C H H H H H H H H H H H H H H H H H H H H
charge: 1.293936 -0.527502 -0.507304 -0.635087 -0.231935 -0.193544 -0.233112 -0.332666 -0.349302 -0.805314 0.117204 0.093092 0.181857 0.184921 -0.352153 -0.350866 -0.254957 -0.241994 -0.208667 -0.209276 -0.652475 -0.661854 0.239798 0.256816 0.234523 0.252693 0.282688 0.315977 0.269444 0.271923 0.238545 0.220976 0.221627 0.245291 0.240886 0.241465 0.215989 0.251660 0.213929 0.228759 0.230457 0.203553
chargesum: 0.00000
title: Mulliken charges with hydrogens summed into heavy atoms:
elementType: P O O O O O N C C C C C C C C C C C C C C C
charge: 1.293936 -0.527502 -0.507304 -0.635087 -0.231935 -0.193544 -0.233112 0.163948 0.137914 -0.206649 0.117204 0.093092 0.181857 0.184921 -0.082710 -0.078943 0.204564 0.224925 0.032219 0.032189 0.029104 0.000915
polarizability: 2.70138417e+02 -1.64645586e+01 2.20932433e+02 2.64069058e+01 1.60098363e+01 1.40449104e+02
1716.lowfreq: -12.4209 -5.6743 -3.7766 -0.0011 0.0004 0.0017 4.1853 15.5157 19.3125
frequency: -8.2957 15.0944 18.9625 26.4796 37.9944 52.1957 73.2111 83.6030 92.8917 98.2091 135.7079 138.8944 150.5305 164.0112 169.6820 184.6601 221.8770 236.7939 245.2660 251.8219 256.0678 281.8680 289.3139 333.9745 343.4681 366.9675 405.7529 411.1297 425.4480 455.5754 472.1351 505.0108 524.2453 585.0899 604.9659 658.9680 659.4895 678.6090 689.5023 711.9166 734.1698 763.4247 785.0622 796.1698 801.9586 814.3054 823.1833 861.2855 874.6779 890.8623 907.2045 924.0324 975.2876 989.5239 1007.6114 1011.5451 1014.6774 1018.7999 1025.6929 1048.2189 1057.9743 1072.7675 1091.8771 1103.3016 1112.8316 1135.2068 1145.4464 1158.2857 1170.2162 1171.6115 1205.3739 1254.0077 1263.4409 1272.7800 1282.7264 1287.9861 1315.0140 1335.0467 1351.8720 1354.1946 1366.6905 1376.3630 1389.1217 1390.4421 1417.3168 1439.0826 1452.9626 1453.9584 1456.5716 1461.0153 1464.2005 1465.0094 1474.9742 1477.2606 1481.9426 1496.7034 1614.7975 1616.6420 1622.8784 1675.6498 2980.5269 2984.4768 2991.8119 3005.1957 3006.4433 3008.5588 3029.0208 3043.5440 3064.3205 3075.1987 3075.6401 3080.9722 3088.8587 3103.9270 3104.5815 3105.5016 3141.3687 3154.4748 3165.8184 3175.9055
redmass: 3.8156 4.6653 2.8253 3.8506 3.5763 4.8156 3.5769 3.0534 3.7259 2.9466 3.6941 5.0663 5.2074 3.1939 4.5366 3.7511 2.2947 1.5989 3.6465 2.1934 2.1426 2.7925 3.6697 7.6060 5.5785 4.7120 3.3191 4.4844 3.6206 4.8565 4.9905 4.0531 7.1656 8.4844 5.6502 4.8081 5.8188 6.0077 5.4070 2.9079 4.1644 1.4811 5.3249 1.6596 1.1230 1.0928 3.6523 3.3272 3.8027 3.4995 1.3921 3.3002 1.4126 2.8181 1.3511 2.9124 2.0984 2.9576 3.1921 3.7850 4.0407 2.6538 2.1392 2.2151 2.7162 1.4370 1.5670 1.2823 1.1525 2.0043 2.8351 1.2923 1.1452 1.1128 1.4704 1.2352 1.2763 3.4286 1.2971 1.2447 1.2329 1.4581 1.2290 1.2495 6.1185 1.0761 2.5476 2.4681 1.0408 1.0465 1.0695 1.1019 1.1027 1.0562 1.0512 1.0827 8.7265 7.9008 9.8439 11.7616 1.0551 1.0356 1.0370 1.0639 1.0614 1.0603 1.0582 1.1075 1.1024 1.1028 1.1003 1.0976 1.0982 1.1044 1.1040 1.1020 1.0865 1.0906 1.0957 1.1004
irintensity: 0.1129 0.6271 0.3519 0.4928 0.2577 0.5058 0.7814 6.1280 1.6999 6.2273 0.1836 0.4044 2.0893 11.7027 16.8502 1.0765 1.5777 5.7699 0.7879 3.4837 3.0076 2.0365 14.3077 19.0559 11.7420 11.2089 1.4208 15.7146 5.3436 0.1929 28.2897 8.1116 10.3457 5.4344 53.8202 1.1257 97.1742 10.9676 7.0670 61.2803 75.1149 33.2225 0.0808 30.8398 4.7093 1.1524 2.6075 166.6534 102.9388 16.7076 0.0071 37.8903 2.1814 21.8565 0.4302 171.2872 7.8738 121.4485 35.4065 54.9392 31.5113 11.0855 14.1995 8.2211 5.3607 8.2012 5.9243 13.5881 5.2215 6.0215 15.3378 35.2781 1.2538 0.2954 5.4825 24.0469 58.0349 214.6435 9.5422 3.4334 3.0261 44.3807 27.4393 21.8620 10.0332 18.6148 0.9064 12.4835 10.3824 11.3386 4.3457 12.7610 24.8616 8.3514 15.3961 8.6805 201.6988 44.8653 258.2491 75.8893 20.8472 16.7203 25.3731 12.2784 42.9524 11.3566 18.7050 19.0493 17.4573 1.9242 4.7018 47.9857 27.5885 36.0163 14.0476 32.6014 1.4832 4.7062 5.2649 19.4493
temp: 298.150 k
press: 1.00000 atm
elementType: 15 8 8 8 8 8 7 6 6 6 6 6 6 6 6 6 6 6 6 6 6 6 1 1 1 1 1 1 1 1 1 1 1 1 1 1 1 1 1 1 1 1
symmnumber: 1
zpe: 868768.6 jmol-1
zpe.correction: 0.330896 hartree
zpe.thermalcorrener: 0.353752 hartree
zpe.thermalcorrenthalpy: 0.354696 hartree
zpe.thermalcorrgfe: 0.275505 hartree
zpe.sumelectzpe: -1354.057153 hartree
zpe.sumelectthermal: -1354.034297 hartree
zpe.sumelectthermalent: -1354.033353 hartree
zpe.sumelectthermalfe: -1354.112545 hartree
dipole: -4.1378 3.9204 2.8620
dipole: 6.3782
quadrupole: -115.8096 -133.9706 -147.9446
quadrupole: -6.4539 11.3304 -7.7866
quadrupole: 16.7654 -1.3957 -15.3696 -6.4539 11.3304 -7.7866
hfenergy: -1354.3880494 hartree
pointgroup: C01 [X(C15H20N1O5P1)]
dipole: 1.9897436 0.7073396 1.355592 debye
polarizability: 259.639865|-47.7538609|152.9998874|11.3524802|14.3580948|218.8802023 unknown
InChI: InChI=1S/C15H20NO5P/c1-3-20-22(19,21-4-2)11-7-10-16-14(17)12-8-5-6-9-13(12)15(16)18/h5-6,8-9H,3-4,7,10-11H2,1-2H3
charge 0 multiplicity 1
42 atoms
P  -3.237317 0.24019 -0.290892
O  -3.970447 1.684697 0.360999
O  -2.675954 -0.674768 1.087255
O  -4.191946 -0.654027 -1.197614
O  1.068975 1.11916 0.495582
O  2.705285 -1.281183 -3.216358
N  1.601165 0.02092 -1.552168
C  -0.920843 -0.108246 -1.864995
C  0.447239 0.422457 -2.380201
C  -1.715617 0.96638 -1.089365
C  1.829417 0.395191 -0.20076
C  2.655209 -0.815251 -2.052971
C  3.123365 -0.250524 0.191776
C  3.616876 -0.977898 -0.91816
C  3.81627 -0.216422 1.410772
C  4.819403 -1.696114 -0.848515
C  -5.444501 1.670238 0.590467
C  -1.939436 0.014421 2.188044
C  5.03471 -0.940507 1.493037
C  5.528473 -1.669015 0.381154
C  -5.815905 0.959179 1.896152
C  -1.767476 -1.023314 3.295007
H  -0.747264 -0.998383 -1.23158
H  -1.5228 -0.453699 -2.724717
H  0.429916 1.525961 -2.453801
H  0.66413 0.017278 -3.383995
H  -2.075353 1.762435 -1.764795
H  -1.098101 1.426978 -0.300793
H  3.42659 0.349682 2.26249
H  5.190113 -2.254909 -1.713353
H  -5.934954 1.190662 -0.278032
H  -5.708618 2.740584 0.616741
H  -2.529788 0.885535 2.53094
H  -0.959802 0.370027 1.812231
H  5.60389 -0.938211 2.428675
H  6.471081 -2.218517 0.475127
H  -5.300491 1.420845 2.756785
H  -5.547117 -0.110881 1.852427
H  -6.906783 1.033133 2.065417
H  -1.205927 -1.89711 2.922652
H  -2.749795 -1.371919 3.656508
H  -1.212071 -0.583153 4.144324
