program: Gaussian 09
title: 000018050
version: EM64L-G09RevD.01
frameworkgroup: C1[X(C4H8O2S)]
method: RPBEPBE
basis: SDD
operation: Freq
keyword: #pfreq=noraman
keyword: PBEPBE/SDD
title: #p freq=noraman PBEPBE/SDD
converged: YES YES NO NO
title: Mulliken charges:
elementType: S O O C C C C H H H H H H H H
charge: -0.010374 -0.264615 -0.242920 -0.426259 -0.699373 0.256404 -0.504954 0.247414 0.266643 0.292548 0.270366 0.235437 0.243083 0.243225 0.093376
chargesum: 0.00000
title: Mulliken charges with hydrogens summed into heavy atoms:
elementType: S O O C C C C
charge: 0.083002 -0.264615 -0.242920 0.087798 -0.136459 0.256404 0.216791
polarizability: 8.87840386e+01 2.74343292e+00 5.96815784e+01 2.04437399e+00 -3.57843402e+00 4.65230863e+01
1716.lowfreq: -33.7957 -9.1382 -0.0035 -0.0026 -0.0022 2.6080 21.6338 62.1790 88.5982
frequency: -16.3967 62.1441 88.5880 119.7738 182.6930 202.9819 258.6039 277.8300 405.2966 558.7193 633.6800 698.1762 727.0212 825.5315 855.5336 946.5851 1027.0518 1074.2661 1113.0118 1136.6903 1148.2836 1156.9495 1252.0189 1271.6387 1335.3034 1422.7418 1440.0980 1453.3733 1453.6166 1464.0768 1643.1651 2427.3549 3004.7380 3006.3234 3052.1574 3062.6558 3107.8507 3126.7219 3151.7302
redmass: 2.1921 3.3818 1.0978 4.1383 3.3016 1.1348 6.0572 4.6674 4.4769 2.8067 5.8749 3.2951 1.2816 1.7390 2.6452 6.3547 1.6915 3.9603 1.2690 2.6350 1.4455 1.2340 1.2407 1.1565 1.6331 1.1882 1.0794 1.0524 1.0863 1.0506 9.0301 1.0384 1.0518 1.0393 1.0592 1.0985 1.1047 1.1066 1.1048
irintensity: 1.5044 0.5756 0.3595 1.1778 13.4579 24.2507 3.5898 23.4303 2.5636 2.1840 16.1891 12.2254 7.4715 17.5708 8.1256 18.3974 4.5645 24.9933 0.8760 192.2530 12.5630 47.4826 36.5056 2.8223 69.0311 22.8224 17.3629 17.8038 14.7614 13.1509 172.6573 31.0789 24.0446 13.7050 12.8323 4.5685 26.4844 8.8274 15.5630
temp: 298.150 k
press: 1.00000 atm
elementType: 16 8 8 6 6 6 6 1 1 1 1 1 1 1 1
symmnumber: 1
zpe: 300113.0 jmol-1
zpe.correction: 0.114307 hartree
zpe.thermalcorrener: 0.122714 hartree
zpe.thermalcorrenthalpy: 0.123658 hartree
zpe.thermalcorrgfe: 0.080299 hartree
zpe.sumelectzpe: -705.152174 hartree
zpe.sumelectthermal: -705.143768 hartree
zpe.sumelectthermalent: -705.142824 hartree
zpe.sumelectthermalfe: -705.186182 hartree
dipole: 2.0475 -1.7841 0.9036
dipole: 2.8621
quadrupole: -47.5731 -54.0526 -48.0624
quadrupole: -0.3511 -2.6354 -1.3695
quadrupole: 2.3229 -4.1565 1.8336 -0.3511 -2.6354 -1.3695
hfenergy: -705.2664814 hartree
pointgroup: C01 [X(C4H8O2S1)]
dipole: 0.8273602 -0.6047357 0.4666617 debye
dipolederiv: -0.2790609 0.0281321 0.1175324 -0.0356555 -0.1656032 -0.1605352 0.1719627 -0.1163445 0.056054 -1.3935756 0.2787401 -0.0711658 0.4145032 -0.6471757 0.0784554 -0.1143752 0.0788086 -0.3167266 -0.664469 -0.1416879 0.0278868 0.2241079 -0.9063211 0.1165453 -0.0566591 0.112757 -0.3299629 -0.3310357 -0.0852153 0.0173995 -0.2765345 -0.1386122 -0.0138837 -0.0680396 -0.028319 0.1012145 0.408228 0.0646311 0.0063229 0.1281018 0.1250807 0.0528075 -0.0888415 -0.0062217 0.0718503 1.4960295 -0.1032218 0.0677828 -0.4913329 1.2700287 -0.2076752 0.201546 -0.1993764 0.2511583 0.6123469 -0.0373091 0.0143352 0.0720114 0.2169184 0.0121509 -0.0174437 0.0135784 0.2752629 0.0604307 -0.0046188 0.0016687 0.0433225 0.0299296 0.0818402 0.0141795 0.108134 0.0011813 0.0701998 -0.0134734 -0.0080008 0.0308846 0.0608176 -0.0656107 0.0240812 -0.0757058 -0.0057443 0.0649583 -0.0272077 0.0088699 0.0172806 0.0339943 0.0709997 -0.011492 0.0792224 0.0265001 -0.0398218 -0.0591512 -0.039428 -0.0140066 0.0132005 -0.0762362 -0.0167885 -0.1020785 -0.0496197 -0.0225 0.0737928 -0.0175432 0.119673 -0.0290672 0.034374 -0.0271363 0.0334852 0.1149726 -0.0059184 0.0101691 0.0065212 -0.0941467 0.0061849 -0.1160379 -0.0255854 -0.0975858 -0.0147276 -0.0046607 0.0039751 -0.0089937 -0.0773254 0.0816768 0.0713111 0.0647393 0.0549599 -0.0889117 0.028849 0.012445 -0.1231877 -0.0608833 0.0489479 0.1214946 -0.0501475 0.1446862 -0.0925013 unknown
polarizability: 88.6249535|3.8401185|58.1892164|1.2451982|-5.6643185|48.1745333 unknown
InChI: InChI=1S/C4H8O2S/c1-6-4(5)2-3-7/h7H,2-3H2,1H3
charge 0 multiplicity 1
15 atoms
S  -3.566784 -0.333485 -0.039195
O  1.662691 -0.786677 0.127385
O  0.858149 1.351319 -0.332701
C  -0.718757 -0.538628 -0.027373
C  -1.862127 0.478682 0.107634
C  0.642315 0.141045 -0.095003
C  3.046219 -0.25548 0.035411
H  -0.714851 -1.26504 0.805204
H  -0.851789 -1.132603 -0.952443
H  -1.831003 1.21587 -0.709401
H  -1.810426 1.0272 1.061053
H  3.692238 -1.122794 0.229178
H  3.202084 0.534856 0.788626
H  3.228697 0.161418 -0.969262
H  -3.479856 -1.082582 1.124485
