program: Gaussian 09
title: 000250267
version: EM64L-G09RevD.01
frameworkgroup: C1[X(C11H16N2O)]
method: RPBEPBE
basis: SDD
operation: Freq
keyword: #p
keyword: freq=noraman
keyword: PBEPBE/SDD
title: #p freq=noraman PBEPBE/SDD
converged: YES YES NO NO
title: Mulliken charges:
elementType: O N N C C C C C C C C C C C H H H H H H H H H H H H H H H H
charge: -0.270161 -0.082259 -0.134410 0.326282 0.225090 -0.347442 -0.353778 -0.361379 -0.349708 -0.240537 -0.151055 -0.591406 -0.628963 -0.687102 0.237564 0.245112 0.227026 0.245513 0.202867 0.203692 0.211706 0.227250 0.223233 0.227974 0.221116 0.290319 0.217538 0.203681 0.231392 0.230844
chargesum: 0.00000
title: Mulliken charges with hydrogens summed into heavy atoms:
elementType: O N N C C C C C C C C C C C
charge: -0.270161 -0.082259 -0.134410 0.326282 0.225090 -0.109878 -0.108666 -0.134352 -0.104196 0.166023 0.060652 0.087050 0.100010 -0.021185
polarizability: 2.66225010e+02 -5.18564820e+00 1.26240238e+02 9.23712640e-01 -5.34744173e+00 8.08152407e+01
1716.lowfreq: -8.1719 -0.0007 -0.0005 0.0006 4.6699 7.3436 39.7975 45.2242 61.9095
frequency: 39.7875 45.1184 61.8455 83.1564 85.3979 115.4186 134.7061 153.4701 179.2305 219.7162 225.6719 247.0418 311.4971 339.3649 341.6425 380.4464 410.5656 422.1379 469.5956 497.1530 535.6808 599.6545 636.5525 724.6975 750.3212 795.0493 827.7408 830.5233 835.1778 880.8583 902.8263 915.5818 944.9151 959.3443 996.3594 1039.7529 1060.0897 1086.4885 1095.4970 1107.2517 1117.8707 1136.4852 1142.7428 1171.8497 1199.2337 1220.6664 1244.1486 1260.4379 1293.8762 1350.4168 1368.8673 1371.6941 1397.6996 1401.0495 1415.1693 1425.3916 1440.6038 1458.9505 1461.1783 1471.7337 1478.0541 1485.3545 1487.6499 1497.6319 1509.8488 1568.3689 1617.6709 1644.1150 2945.4278 2947.8842 2957.8103 2978.1500 2995.5266 3001.2775 3018.3900 3031.3666 3083.6571 3092.6542 3104.2452 3108.7910 3122.5315 3146.1862 3158.1548 3169.2441
redmass: 3.5640 2.4432 2.4369 4.2937 1.7325 1.7562 1.2637 3.1085 4.0500 2.1133 3.0683 1.1980 4.1728 3.2528 3.0173 4.2963 3.3503 3.2353 3.7090 4.5010 2.4850 5.5132 6.8539 3.6400 4.6115 1.3252 4.9915 1.1525 1.5218 3.9463 3.1318 1.4146 1.4798 1.3427 2.6214 2.8764 1.3577 1.8716 1.2245 1.3681 1.9745 1.4369 1.3699 1.2622 2.6624 4.1095 3.6088 1.1440 1.3112 3.6806 1.3776 1.5045 1.5163 2.1710 1.1673 3.1969 1.2202 1.0444 1.0403 1.1031 1.0962 1.1295 1.1749 1.3751 1.4924 7.5145 6.4676 5.9698 1.0551 1.0369 1.0374 1.0858 1.0361 1.1072 1.0997 1.1006 1.0976 1.0988 1.1012 1.0975 1.0881 1.0875 1.0938 1.0972
irintensity: 1.4193 0.3804 1.9153 0.0622 0.4177 2.6607 0.5098 0.4155 4.4824 2.4987 0.3818 1.0723 7.7143 1.8771 17.4781 1.4807 0.7980 0.8674 1.1693 12.9197 16.5047 14.0565 2.2889 2.0559 15.6495 28.2496 3.8153 17.7486 49.8017 5.1311 52.4694 6.4669 26.8848 0.2807 3.6550 94.7594 4.7353 265.9317 1.4048 8.9217 10.7409 4.2698 4.5125 31.8771 163.5772 168.1952 21.1196 0.0732 4.0603 5.2572 3.9184 85.6773 84.8710 3.8927 22.7546 32.3896 6.2654 8.8677 11.3154 19.6695 51.2005 69.0688 64.4126 66.1038 72.1432 4.0953 22.9364 851.8927 43.3265 106.6050 162.6295 51.4563 31.5106 42.9111 53.4211 35.8157 28.5858 31.4475 36.4632 1.2843 20.7094 9.7674 22.2471 8.1965
temp: 298.150 k
press: 1.00000 atm
elementType: 8 7 7 6 6 6 6 6 6 6 6 6 6 6 1 1 1 1 1 1 1 1 1 1 1 1 1 1 1 1
symmnumber: 1
zpe: 656674.4 jmol-1
zpe.correction: 0.250114 hartree
zpe.thermalcorrener: 0.265359 hartree
zpe.thermalcorrenthalpy: 0.266303 hartree
zpe.thermalcorrgfe: 0.206741 hartree
zpe.sumelectzpe: -612.407401 hartree
zpe.sumelectthermal: -612.392157 hartree
zpe.sumelectthermalent: -612.391212 hartree
zpe.sumelectthermalfe: -612.450774 hartree
dipole: 2.4767 -3.3173 -0.2644
dipole: 4.1483
quadrupole: -57.3594 -78.8397 -87.2495
quadrupole: 1.1041 -2.9861 -0.6753
quadrupole: 17.1234 -4.3568 -12.7666 1.1041 -2.9861 -0.6753
hfenergy: -612.6575155 hartree
pointgroup: C01 [X(C11H16N2O1)]
dipole: -0.977597 -1.2687468 -0.3134698 debye
polarizability: 266.2577622|4.5365305|118.3492906|1.6211044|17.9859753|88.6734365 unknown
InChI: InChI=1S/C11H16N2O/c1-4-14-11-7-5-10(6-8-11)12-9-13(2)3/h5-9H,4H2,1-3H3
charge 0 multiplicity 1
30 atoms
O  3.637141 0.184003 0.391697
N  -4.195446 -0.441537 0.082785
N  -2.027038 0.499681 0.218335
C  2.231432 0.169059 0.29422
C  -0.618564 0.339259 0.229587
C  1.480298 -0.801548 -0.412069
C  1.562603 1.234213 0.950457
C  0.069885 -0.71066 -0.441657
C  0.16208 1.319779 0.909862
C  4.377716 -0.894401 -0.284796
C  -2.824025 -0.542765 0.235778
C  -5.069802 -1.602349 0.266465
C  -4.83167 0.862042 -0.144283
C  5.860669 -0.65024 -0.015233
H  1.973562 -1.615818 -0.951715
H  2.161873 1.982238 1.479094
H  -0.49883 -1.443208 -1.027541
H  -0.361676 2.142655 1.406728
H  4.053189 -1.877653 0.116249
H  4.158778 -0.870299 -1.373131
H  -2.475474 -1.583337 0.389829
H  -5.731601 -1.738785 -0.611308
H  -4.463681 -2.516406 0.387964
H  -5.710757 -1.49045 1.165079
H  -5.44507 1.164093 0.728334
H  -4.034705 1.606337 -0.295736
H  -5.485579 0.823483 -1.036982
H  6.471027 -1.432789 -0.502094
H  6.170203 0.332524 -0.410007
H  6.066363 -0.66812 1.068688
