program: Gaussian 09
title: 000250265
version: EM64L-G09RevD.01
frameworkgroup: C1[X(C8H13Cl2NO2)]
method: RPBEPBE
basis: SDD
operation: Freq
keyword: #p
keyword: freq=noraman
keyword: PBEPBE/SDD
title: #p freq=noraman PBEPBE/SDD
converged: YES YES NO NO
title: Mulliken charges:
elementType: Cl Cl O O N C C C C C C C C H H H H H H H H H H H H H
charge: -0.049310 -0.050975 -0.288224 -0.290747 -0.071754 -0.372781 -0.389065 -0.581545 -0.535389 -0.059583 -0.390179 0.229586 -0.504282 0.265390 0.257270 0.251618 0.241979 0.297670 0.262825 0.267803 0.284044 0.265255 0.259060 0.236382 0.236862 0.228091
chargesum: 0.00000
title: Mulliken charges with hydrogens summed into heavy atoms:
elementType: Cl Cl O O N C C C C C C C C
charge: -0.049310 -0.050975 -0.288224 -0.290747 -0.071754 0.149879 0.104532 -0.021049 0.016458 0.205672 -0.131120 0.229586 0.197052
polarizability: 1.76575725e+02 3.89621678e+00 1.17646895e+02 2.76086607e+00 -1.64287395e+01 9.23124695e+01
1716.lowfreq: -9.7664 -4.4879 0.0028 0.0030 0.0030 5.2834 27.7216 33.7415 48.6495
frequency: 27.6376 33.7225 48.6439 55.9087 78.1841 93.0059 95.6745 108.5678 136.0200 191.6215 217.8622 230.7218 247.8096 282.2000 301.8474 362.6808 367.5760 470.0582 491.9236 554.3629 608.8851 670.4542 683.8914 691.1012 778.7906 806.2363 827.7572 891.0972 908.2101 957.3049 975.8894 998.8130 1004.9901 1033.7250 1045.5458 1112.8211 1112.9697 1131.0693 1147.5239 1155.7612 1209.3019 1224.2001 1259.4081 1279.5095 1294.4348 1304.4167 1345.2483 1355.2441 1361.4618 1407.3838 1429.2396 1438.0151 1450.7862 1453.3850 1460.1518 1465.2520 1491.8525 1605.0924 1652.5400 2980.1647 2997.7685 3024.2298 3052.1402 3062.1243 3065.9654 3094.6498 3095.7349 3113.0505 3140.0021 3140.3678 3148.1283 3175.3698
redmass: 9.0963 9.3790 6.9704 7.7161 3.0969 2.2796 1.3387 3.0001 3.8481 4.8322 4.6318 4.1193 3.3378 3.8902 3.7780 2.8261 3.3833 3.1618 2.7665 3.7302 5.0918 4.8051 5.7213 5.9730 1.2273 2.8928 1.7685 2.8264 2.6037 2.3356 1.2142 5.0903 1.6121 1.7225 3.9050 2.3394 1.2676 1.7441 1.4309 1.2409 1.8094 1.3548 1.1658 1.2716 1.3418 1.3027 1.2903 1.3981 1.5441 1.7927 1.3941 1.0968 1.0503 1.0892 1.1134 1.0534 1.1157 10.0005 5.5258 1.0651 1.0298 1.0631 1.0616 1.0566 1.0933 1.1024 1.1040 1.0912 1.1042 1.1109 1.1115 1.0921
irintensity: 0.3677 0.9358 3.3416 1.1228 2.0245 3.5232 1.2237 1.7737 4.5934 9.1639 0.9711 3.4993 3.6835 16.2126 5.8552 4.0753 3.9310 3.9944 11.0785 6.3630 15.2386 2.2045 13.6062 58.9822 2.9436 19.2747 42.2622 4.4517 33.4643 10.6027 33.8575 73.5295 10.8198 2.1164 2.9087 522.4179 3.1986 38.5327 12.3351 11.5950 38.1175 80.5191 11.8085 12.2729 24.5841 8.4358 57.0876 91.8712 3.6218 59.6114 7.6151 8.7027 12.5924 9.6919 20.2786 16.3130 11.4879 430.9339 493.2834 33.2698 51.7535 8.3293 14.2419 17.7447 11.6616 2.0430 33.0014 2.8316 24.0482 12.0512 10.7254 11.1727
temp: 298.150 k
press: 1.00000 atm
elementType: 17 17 8 8 7 6 6 6 6 6 6 6 6 1 1 1 1 1 1 1 1 1 1 1 1 1
symmnumber: 1
zpe: 535421.5 jmol-1
zpe.correction: 0.203931 hartree
zpe.thermalcorrener: 0.219503 hartree
zpe.thermalcorrenthalpy: 0.220448 hartree
zpe.thermalcorrgfe: 0.157537 hartree
zpe.sumelectzpe: -1436.926329 hartree
zpe.sumelectthermal: -1436.910757 hartree
zpe.sumelectthermalent: -1436.909813 hartree
zpe.sumelectthermalfe: -1436.972724 hartree
dipole: 1.5692 -1.3891 2.4297
dipole: 3.2087
quadrupole: -92.2489 -99.2968 -90.5892
quadrupole: -9.1086 11.5463 -2.1578
quadrupole: 1.7961 -5.2518 3.4558 -9.1086 11.5463 -2.1578
hfenergy: -1437.1302607 hartree
pointgroup: C01 [X(C8H13Cl2N1O2)]
dipole: 0.6881716 0.467958 -0.9492436 debye
dipolederiv: -0.2347354 0.1323068 -0.0509685 0.2327274 -0.5488551 0.1105773 -0.1228772 0.2023672 -0.257389 -0.2729203 -0.0550577 -0.1525956 -0.0198495 -0.2409042 0.0099607 -0.1836468 -0.0818745 -0.4306081 -1.5829032 -0.2126102 0.2469924 -0.5155002 -0.5209195 0.2039955 0.5040829 0.1858789 -0.4870903 -0.8893959 0.1554347 -0.0936043 0.3363999 -0.7355699 0.3014377 -0.2384256 0.3078517 -0.5760703 -1.8437882 -0.0837811 0.098902 0.3211455 -0.7261551 0.0169496 -0.0057852 0.054794 -0.2877013 0.1601032 -0.1058087 0.0035788 -0.3071511 0.4836467 -0.0801768 0.2152849 0.0449088 0.1469799 0.4938473 0.3208728 -0.130586 0.4797735 0.4511406 -0.0314892 -0.4233897 -0.1794433 0.1644635 0.2363919 -0.1717738 0.0744158 -0.2380214 0.5668143 -0.2223546 0.0764118 -0.3389142 0.2906939 0.2726211 -0.0027968 0.2221179 -0.0989564 0.0755873 -0.0086241 0.338736 0.0144973 0.5435701 2.0462942 -0.0507552 -0.0855447 0.1673392 -0.0023923 -0.0347016 -0.2899006 0.0037521 0.0400868 -1.6621315 0.0508869 0.0196943 -0.3169337 -0.1536489 -0.1027027 0.3181944 -0.1478748 -0.2329071 2.5271781 -0.0072022 -0.1254001 -0.0637561 0.8541914 -0.5091018 -0.1003944 -0.4915838 0.6429935 0.8018898 0.0388627 -0.0623018 -0.0353088 0.2463763 0.0331785 -0.0091391 0.0282409 0.2647914 -0.0626538 -0.0165855 -0.0496954 0.0156133 0.0691899 -0.0103531 -0.0395237 -0.011489 0.0883659 0.0536895 -0.0057777 0.108317 0.0349587 0.0164327 0.012104 0.0248088 0.0113096 -0.0295927 -0.088683 0.0401112 0.0549453 0.0428913 -0.0057392 -0.0422505 0.0234168 0.0092092 0.1112601 0.0545648 -0.0082364 -0.119522 -0.1046618 -0.0080395 0.016039 0.0081444 0.0690164 -0.0906413 -0.043879 -0.0435754 -0.0751481 0.001167 0.0212155 0.0441537 -0.0473606 0.0309031 0.0424769 0.0126941 0.0408972 0.0755213 0.0059246 0.0063367 0.0760328 0.0624518 0.0302925 -0.0707021 -0.0198793 -0.0949958 0.016598 -0.1213341 -0.0088565 0.0638567 -0.0025081 0.075234 -0.0507808 -0.0495247 0.0927474 -0.0196554 0.0621188 0.0745724 -0.0169589 -0.0475847 -0.0195936 -0.0099551 0.1348412 0.0256219 0.002476 0.0077942 0.0370183 0.0849322 0.0122483 0.10091 0.0775552 0.072346 0.0363385 -0.0224843 0.0678058 0.0350384 0.1131689 -0.0430486 0.1211658 0.1106729 -0.050916 -0.011278 -0.0066464 0.0418435 0.0935775 -0.0255389 -0.1200704 -0.0441806 -0.1094309 -0.0414784 -0.0059536 0.0145027 0.1154018 -0.0923712 -0.094471 -0.009418 -0.0644422 0.0689748 -0.0235727 -0.0578921 0.0560909 -0.1114316 0.0123135 0.0923367 0.0992927 0.0890646 0.039984 unknown
polarizability: 176.5080114|-1.7143076|114.4043336|4.3492915|-18.6538751|95.6227447 unknown
InChI: InChI=1S/C8H13Cl2NO2/c1-13-8(12)2-5-11(6-3-9)7-4-10/h2,5H,3-4,6-7H2,1H3
charge 0 multiplicity 1
26 atoms
Cl 2.338903 -3.650951 0.844892
Cl 3.459191 2.099051 1.318803
O  -3.398105 -0.576054 0.553416
O  -2.823593 1.173087 -0.894488
N  1.294344 0.176575 -0.351568
C  1.79329 -0.929264 0.491844
C  2.257317 1.064274 -1.029048
C  1.737131 -2.260636 -0.28015
C  2.527062 2.387514 -0.299652
C  -0.057069 0.432919 -0.470836
C  -1.103861 -0.235774 0.126453
C  -2.466269 0.217796 -0.14835
C  -4.814223 -0.202163 0.356849
H  2.827915 -0.711958 0.802804
H  1.186565 -1.000326 1.412285
H  3.208368 0.523417 -1.178108
H  1.86832 1.320446 -2.035914
H  0.713531 -2.530363 -0.576243
H  2.40791 -2.268262 -1.152337
H  3.174464 3.048593 -0.896744
H  1.597432 2.902752 -0.015719
H  -0.320884 1.269931 -1.132099
H  -0.983327 -1.086095 0.801573
H  -5.093309 -0.285789 -0.707653
H  -4.990456 0.835083 0.690091
H  -5.382147 -0.915804 0.970998
