program: Gaussian 09
title: 000254197
version: EM64L-G09RevD.01
frameworkgroup: C1[X(C14H15ClN2)]
method: RPBEPBE
basis: SDD
operation: Freq
keyword: #p
keyword: freq=noraman
keyword: PBEPBE/SDD
title: #p freq=noraman PBEPBE/SDD
converged: YES YES NO NO
title: Mulliken charges:
elementType: Cl N N C C C C C C C C C C C C C C H H H H H H H H H H H H H H H
charge: -0.065020 -0.155295 -0.101357 -0.566342 -0.370330 0.534843 0.252036 -0.668758 -0.453842 -0.356313 -0.321893 -0.203649 -0.215877 -0.109045 -0.187001 -0.359032 -0.216316 0.213171 0.288068 0.220430 0.234743 0.219200 0.235160 0.218354 0.236648 0.263399 0.233503 0.253345 0.253706 0.230659 0.234192 0.228615
chargesum: 0.00000
title: Mulliken charges with hydrogens summed into heavy atoms:
elementType: Cl N N C C C C C C C C C C C C C C
charge: -0.065020 -0.155295 -0.101357 -0.065104 0.084844 0.534843 0.252036 0.003955 -0.217194 -0.092914 -0.088390 0.049696 0.037829 -0.109045 0.043658 -0.124840 0.012299
polarizability: 2.46376466e+02 -2.51378210e+01 1.65338289e+02 -4.81455498e+00 5.69788165e+00 1.19137123e+02
1716.lowfreq: -14.6270 -0.0020 0.0006 0.0011 0.2134 3.9507 16.7913 27.7419 42.5056
frequency: 16.3404 27.2005 42.4641 62.1030 96.4215 112.4754 140.3640 170.6794 210.0481 222.2633 263.0003 296.1165 324.1062 370.6729 383.8695 407.4361 413.3174 417.9596 478.1965 512.4706 529.4744 575.0025 617.3072 625.5152 647.1131 709.7452 732.1556 748.1037 769.0724 788.2444 797.7182 829.3027 831.4752 848.6657 888.8633 942.0396 944.7623 950.7291 968.1665 977.7196 984.6374 998.1766 1011.5155 1043.2643 1070.4942 1074.2168 1091.4408 1107.9288 1137.2049 1172.0293 1182.2698 1187.1993 1209.9118 1249.4305 1275.8942 1294.8795 1313.5380 1334.2099 1343.0241 1352.5852 1379.2964 1387.8154 1391.0622 1400.5292 1427.0421 1453.0229 1469.4767 1475.7429 1476.6057 1484.5550 1501.9787 1550.0321 1588.1119 1597.6577 1599.8931 2971.4838 2984.4475 2996.9121 3045.1050 3046.8144 3081.2046 3090.0436 3121.6890 3123.2338 3135.7517 3145.6175 3167.1484 3167.2623 3170.6293 3177.8489
redmass: 4.6378 4.7082 5.2840 3.4262 3.7520 4.2486 5.9681 3.8327 1.1581 4.9633 3.6079 5.3621 3.3322 4.6921 2.0590 3.3646 3.7545 3.8629 3.0014 2.8952 3.2417 4.5051 6.9254 6.7918 4.9334 4.0007 1.7201 3.4588 2.5310 1.5368 1.9824 1.7504 1.2687 1.3607 2.2308 2.3707 1.4190 2.0913 1.3821 1.3455 2.3152 4.0165 2.5743 2.2686 2.7160 2.1036 1.6801 1.3642 1.8296 1.1836 1.1182 2.0675 2.7880 1.4772 1.3042 1.2974 1.7491 2.8841 1.6917 1.3764 4.1303 1.2588 2.2123 2.1178 2.0440 1.1725 1.0476 1.8925 1.6953 1.2892 1.3519 5.3447 7.3233 5.9185 6.1188 1.0638 1.0356 1.0612 1.0982 1.1004 1.0996 1.1011 1.0892 1.0898 1.0889 1.0888 1.0930 1.0952 1.0966 1.1001
irintensity: 0.1169 0.3803 1.1675 0.0477 1.1583 2.9821 1.7274 0.2522 0.1206 0.3858 2.0816 2.3770 2.4107 0.4290 6.6185 14.3984 18.4164 3.2343 10.9301 14.8376 1.0873 11.1152 1.3882 0.0469 5.9720 1.7403 33.4762 5.9281 56.2890 21.7194 26.1743 44.0672 1.8259 0.3954 17.8827 25.6416 0.7328 4.4357 0.7595 1.8828 31.2273 46.1385 5.5491 12.3470 37.9152 13.7394 3.0080 14.3573 10.5259 3.3146 1.8542 30.1917 8.3339 78.0257 25.4081 3.4352 11.6539 38.2817 9.0593 27.9490 9.0526 26.1488 0.2755 34.9172 21.1371 38.6109 6.8981 61.9518 89.0677 66.2861 91.0730 35.9840 15.0846 318.6785 20.1892 57.7990 30.1046 31.3942 29.6862 7.0576 40.9226 41.0904 26.4439 12.3241 11.9594 3.4812 29.5868 8.7357 0.6863 14.5125
temp: 298.150 k
press: 1.00000 atm
elementType: 17 7 7 6 6 6 6 6 6 6 6 6 6 6 6 6 6 1 1 1 1 1 1 1 1 1 1 1 1 1 1 1
symmnumber: 1
zpe: 674278.4 jmol-1
zpe.correction: 0.256819 hartree
zpe.thermalcorrener: 0.272535 hartree
zpe.thermalcorrenthalpy: 0.273479 hartree
zpe.thermalcorrgfe: 0.210969 hartree
zpe.sumelectzpe: -1110.822001 hartree
zpe.sumelectthermal: -1110.806286 hartree
zpe.sumelectthermalent: -1110.805341 hartree
zpe.sumelectthermalfe: -1110.867852 hartree
dipole: 2.6436 2.2774 -0.7270
dipole: 3.5642
quadrupole: -113.1780 -99.3213 -106.7310
quadrupole: -4.8098 -7.6888 1.6942
quadrupole: -6.7679 7.0888 -0.3209 -4.8098 -7.6888 1.6942
hfenergy: -1111.0788205 hartree
pointgroup: C01 [X(C14H15Cl1N2)]
dipole: 1.0869716 0.7979629 -0.3848609 debye
polarizability: 243.0244292|-30.0924229|169.3350716|-2.9604292|1.1311871|118.4923761 unknown
InChI: InChI=1S/C14H15ClN2/c1-2-17(14-5-3-4-10-16-14)11-12-6-8-13(15)9-7-12/h3-10H,2,11H2,1H3
charge 0 multiplicity 1
32 atoms
Cl -5.71272 -0.557589 -0.544249
N  1.037579 0.818186 -0.020834
N  1.955614 -1.098322 1.002221
C  0.057576 0.912414 1.081545
C  0.988037 1.863476 -1.059882
C  -1.367689 0.568503 0.659141
C  2.035329 -0.156275 0.000867
C  1.891178 3.082525 -0.755487
C  -2.44975 1.424134 0.9784
C  -1.635401 -0.638838 -0.036873
C  3.091742 -0.197275 -0.969808
C  -3.777472 1.091006 0.620288
C  -2.95201 -0.989113 -0.404634
C  -4.004744 -0.114257 -0.068069
C  4.037972 -1.233907 -0.896616
C  2.892443 -2.082173 1.053283
C  3.951736 -2.208188 0.129811
H  0.082521 1.935278 1.509007
H  0.399842 0.20441 1.857301
H  1.252743 1.42335 -2.03924
H  -0.064586 2.190628 -1.145631
H  1.602955 3.555895 0.200431
H  2.952198 2.786254 -0.679961
H  1.798168 3.841664 -1.553948
H  -2.262672 2.362205 1.515532
H  -0.805407 -1.30841 -0.286643
H  3.176458 0.563331 -1.749621
H  -4.611118 1.75483 0.867226
H  -3.157473 -1.922482 -0.936984
H  4.847681 -1.276766 -1.63382
H  2.775674 -2.798792 1.875386
H  4.674901 -3.023803 0.213559
