program: Gaussian 09
title: 000250261
version: EM64L-G09RevD.01
frameworkgroup: C1[X(C10H13Cl3NPS)]
method: RPBEPBE
basis: SDD
operation: Freq
keyword: #p
keyword: freq=noraman
keyword: PBEPBE/SDD
title: #p freq=noraman PBEPBE/SDD
converged: YES YES NO NO
title: Mulliken charges:
elementType: Cl Cl Cl S P N C C C C C C C C C C H H H H H H H H H H H H H
charge: -0.207207 -0.051155 -0.049627 -0.145333 0.345568 -0.397277 -0.341046 -0.320668 0.011904 -0.551566 -0.552612 -0.270034 -0.289161 -0.222132 -0.209352 -0.215763 0.246399 0.285314 0.257064 0.274658 0.263908 0.298614 0.267592 0.288970 0.280324 0.274797 0.243265 0.243158 0.241400
chargesum: 0.00000
title: Mulliken charges with hydrogens summed into heavy atoms:
elementType: Cl Cl Cl S P N C C C C C C C C C C
charge: -0.207207 -0.051155 -0.049627 -0.145333 0.345568 -0.397277 0.190667 0.211054 0.011904 0.010955 0.003950 0.010290 -0.014364 0.021132 0.033806 0.025637
polarizability: 2.28399945e+02 -1.54702559e+01 1.67380894e+02 -7.66027909e+00 1.63984479e+01 1.67627652e+02
1716.lowfreq: -9.4184 -5.8018 -0.0028 -0.0024 0.0011 4.0518 17.5773 24.3083 30.8488
frequency: 16.8559 24.0623 30.7916 36.5405 54.8469 80.8688 82.0817 92.9132 115.6370 133.6861 158.6874 175.8332 199.2155 212.3795 217.4793 240.8025 262.6677 307.5081 352.1210 396.8194 408.9780 417.6312 477.2249 495.4846 590.8946 611.7528 662.0697 691.3145 693.5213 700.1902 712.3258 764.9765 770.3348 772.3969 859.0806 939.5361 946.0318 983.6607 985.5301 996.4787 1006.8217 1018.6182 1033.0985 1043.7792 1055.0258 1077.2945 1084.9619 1107.4064 1178.0210 1194.2846 1195.1767 1227.3329 1251.1665 1258.0713 1282.5380 1310.5101 1321.1229 1345.4762 1352.5914 1378.7553 1424.9542 1445.9596 1451.5413 1458.4989 1462.4160 1479.1224 1584.8933 1588.9003 3014.8657 3018.1982 3063.6828 3064.8637 3078.6915 3082.4352 3136.9778 3144.1072 3151.4220 3152.2901 3152.7434 3162.6856 3174.6192
redmass: 4.9835 10.3715 6.9945 11.4001 12.5298 2.9039 4.5002 2.4043 11.5298 10.4437 7.7907 6.9566 6.2201 4.5452 4.2562 9.5351 5.8797 4.7202 4.7782 2.8305 4.1465 10.5760 5.2972 4.9648 9.0453 6.6736 8.3976 6.6615 2.5007 4.4248 4.0727 1.5220 1.1747 1.1898 1.2432 1.3919 2.7294 6.2465 1.3841 1.4866 1.3338 3.3597 2.7707 2.1377 2.6028 2.3821 1.6919 1.8366 1.0535 1.2045 1.8349 1.5608 1.1571 1.1549 1.1415 1.3213 1.2041 1.2293 1.2500 8.3956 2.1063 1.0794 1.0949 1.0931 1.9748 1.0736 5.9838 5.8708 1.0604 1.0605 1.0573 1.0569 1.1023 1.1047 1.0857 1.0885 1.1119 1.1071 1.0977 1.0966 1.1017
irintensity: 0.2744 0.5404 0.5715 0.1085 2.0847 1.9864 1.2552 3.1989 0.4905 1.8936 2.8586 6.6988 0.1992 6.9600 1.8883 8.7705 9.8727 10.4727 4.2657 0.0651 26.0786 48.6777 23.4921 37.5425 40.1221 4.9047 2.3826 5.2734 14.9042 132.0671 142.0892 24.7989 12.6423 20.6461 0.0695 1.1093 99.0086 3.5969 0.3581 2.8429 0.0442 1.4547 3.8857 16.1644 8.5648 27.4051 5.2351 47.6976 0.0193 2.5373 54.8237 3.5819 13.4584 12.1837 5.0647 7.0138 9.5645 3.5552 0.5665 0.4996 23.6045 9.4661 1.5765 26.9296 12.9982 13.4383 0.4700 0.5347 9.5654 10.5946 7.7627 12.8099 5.1312 1.3021 0.3660 3.2715 6.1408 10.4568 1.5894 8.6413 25.0609
temp: 298.150 k
press: 1.00000 atm
elementType: 17 17 17 16 15 7 6 6 6 6 6 6 6 6 6 6 1 1 1 1 1 1 1 1 1 1 1 1 1
symmnumber: 1
zpe: 560373.5 jmol-1
zpe.correction: 0.213435 hartree
zpe.thermalcorrener: 0.232144 hartree
zpe.thermalcorrenthalpy: 0.233089 hartree
zpe.thermalcorrgfe: 0.161646 hartree
zpe.sumelectzpe: -2561.887815 hartree
zpe.sumelectthermal: -2561.869106 hartree
zpe.sumelectthermalent: -2561.868161 hartree
zpe.sumelectthermalfe: -2561.939604 hartree
dipole: -4.6007 2.0365 -1.6275
dipole: 5.2880
quadrupole: -127.6112 -151.5111 -128.9855
quadrupole: 5.8335 2.7782 1.5307
quadrupole: 8.4248 -15.4752 7.0504 5.8335 2.7782 1.5307
hfenergy: -2562.10125 hartree
pointgroup: C01 [X(C10H13Cl3N1P1S1)]
dipole: 1.5047157 -1.3940563 -0.3474267 debye
polarizability: 214.1244523|-28.4201897|174.0634122|9.0733701|-19.8251974|175.2206265 unknown
InChI: InChI=1S/C10H13Cl2NPS.Cl/c11-6-8-13(9-7-12)14(15)10-4-2-1-3-5-10;/h1-5H,6-9H2;
charge 0 multiplicity 1
29 atoms
Cl -0.424111 2.074453 2.26454
Cl -5.329193 1.228408 -0.446821
Cl -0.765409 -3.873371 1.140714
S  -0.435897 2.778025 -1.387712
P  -0.176798 1.317708 0.043978
N  -1.371273 0.047901 -0.037328
C  -2.696275 0.329856 -0.640884
C  -1.26009 -1.140404 0.846156
C  1.478065 0.469227 0.123834
C  -3.609575 1.110783 0.322286
C  -0.796959 -2.352146 0.022143
C  2.111286 0.154721 1.346819
C  2.096401 0.168011 -1.116117
C  3.368002 -0.492231 1.326833
C  3.351749 -0.478056 -1.122826
C  3.98615 -0.812539 0.096864
H  -3.160643 -0.638122 -0.901698
H  -2.558111 0.906581 -1.572084
H  -2.241577 -1.349433 1.309467
H  -0.553291 -0.950927 1.67191
H  -3.74465 0.604463 1.289566
H  -3.269879 2.145825 0.469501
H  -1.491021 -2.593432 -0.7963
H  0.227418 -2.227964 -0.35579
H  1.642291 0.432612 2.296007
H  1.613541 0.452761 -2.057119
H  3.86293 -0.737606 2.272074
H  3.834212 -0.710828 -2.077812
H  4.962105 -1.309675 0.087303
