program: Gaussian 09
title: 000250260
version: EM64L-G09RevD.01
frameworkgroup: C1[X(C24H22N2O6S)]
method: RPBEPBE
basis: SDD
operation: Freq
keyword: #p
keyword: freq=noraman
keyword: PBEPBE/SDD
title: #p freq=noraman PBEPBE/SDD
converged: YES YES NO NO
title: Mulliken charges:
elementType: S O O O O O O N N C C C C C C C C C C C C C C C C C C C C C C C C H H H H H H H H H H H H H H H H H H H H H H
charge: 0.194936 -0.242626 -0.307208 -0.268838 -0.242392 -0.245376 -0.194246 -0.176737 -0.406318 -0.081322 -0.035045 -0.517341 -0.029914 -0.754854 -0.209738 0.215830 0.230092 0.198117 0.093565 0.216102 -0.774731 -0.245628 0.407978 -0.337038 -0.338688 -0.219723 -0.223530 -0.349138 -0.312541 -0.217481 -0.219641 -0.228753 -0.219778 0.277279 0.302563 0.259193 0.284687 0.274352 0.275304 0.304456 0.301173 0.359302 0.247489 0.225180 0.244935 0.271417 0.266986 0.238361 0.237710 0.273869 0.250147 0.237618 0.236681 0.236415 0.236890
chargesum: 0.00000
title: Mulliken charges with hydrogens summed into heavy atoms:
elementType: S O O O O O O N N C C C C C C C C C C C C C C C C C C C C C C C C
charge: 0.194936 -0.242626 -0.307208 -0.268838 -0.242392 -0.245376 -0.194246 -0.176737 -0.047016 0.195957 0.267518 0.026539 0.244438 -0.175094 0.091434 0.215830 0.230092 0.198117 0.093565 0.216102 -0.057127 -0.245628 0.407978 -0.065621 -0.071702 0.018638 0.014180 -0.075270 -0.062394 0.020137 0.017041 0.007662 0.017112
polarizability: 3.61761154e+02 -1.80084218e+01 3.13394117e+02 1.15851249e+01 2.02453224e+01 2.73337515e+02
1716.lowfreq: -10.3363 -5.8962 -2.9820 -2.8884 -0.0012 -0.0010 0.0012 10.5281 15.4437
frequency: -7.0116 10.3708 15.1880 16.0384 21.9857 27.3013 38.8581 43.4944 47.8125 61.7792 66.8944 92.1887 101.0222 106.6074 128.8501 135.7467 153.1300 167.6700 178.0837 179.6722 187.4514 217.7405 246.4519 277.1245 280.7322 283.2760 293.7449 323.0611 340.2867 379.6331 379.8107 395.9356 402.4896 405.9027 425.9217 427.6369 436.8614 455.7146 462.8083 480.9182 509.6629 525.6143 543.0509 607.5092 612.5926 613.6536 630.8236 653.2689 666.4494 669.0301 679.0184 691.2181 695.1942 698.3561 701.5942 716.3769 718.5048 743.3397 748.5513 780.2955 784.4075 788.0235 795.7245 798.8519 834.8850 855.6038 862.7176 865.8088 879.9241 906.1996 913.9933 943.1286 946.1160 956.0605 956.5920 987.9530 989.3250 989.8197 990.2243 997.2932 1007.7332 1011.0981 1014.4507 1017.6986 1026.1615 1034.1346 1039.6153 1051.8136 1056.2017 1072.9563 1087.2774 1088.9973 1117.5664 1137.7288 1159.3802 1175.5987 1176.0203 1182.4019 1188.9077 1203.5077 1212.0798 1219.3835 1230.5135 1238.1446 1246.0822 1264.7695 1285.5613 1296.2509 1314.6284 1315.7815 1321.1430 1332.2744 1345.2018 1352.2431 1369.5734 1384.9358 1388.9342 1390.6509 1402.5118 1407.0995 1436.3244 1438.5875 1439.8592 1451.2817 1458.8265 1472.5332 1477.2356 1477.7564 1574.2254 1584.2447 1601.3418 1608.5102 1610.8434 1618.4284 1623.7317 1638.9530 1668.1922 2986.3466 3023.7763 3036.4329 3062.5163 3066.8602 3070.7729 3080.8730 3094.8052 3106.4695 3109.9453 3132.9148 3133.9183 3140.3456 3145.3447 3151.0311 3156.6969 3162.4838 3167.2121 3168.7295 3172.8046 3175.8859 3525.4581
redmass: 5.1641 6.1841 6.1393 5.3066 5.2267 6.0041 6.6060 8.1978 6.6252 6.8673 6.8043 3.2846 1.8342 2.4554 6.5698 4.4143 5.6798 6.0878 4.6937 5.5395 5.0255 6.1972 4.8541 3.4497 4.0669 5.0828 4.7963 5.7850 5.4244 5.2781 5.1798 2.8006 2.8289 10.9598 3.8207 4.3767 4.1867 3.9539 5.8978 4.2744 4.2736 8.4993 5.7824 5.4251 6.4598 6.4464 5.0577 6.9130 4.0187 7.1062 5.1674 1.7986 5.1029 2.7443 1.6262 4.5930 4.6768 5.4605 5.4122 2.3096 1.9056 4.7772 2.2142 3.3802 4.5781 1.2535 3.5902 1.2484 6.7997 1.3735 3.5646 3.2018 1.4261 1.8148 1.8216 2.5251 4.7424 1.4450 5.6980 1.4061 1.3369 1.3356 4.0734 2.0029 2.1657 2.8250 2.5154 1.5060 1.9557 4.2930 1.6478 1.5763 2.2782 3.7490 1.5921 1.0660 1.0566 1.1398 1.2261 1.2528 2.8407 1.6956 4.4006 3.2850 1.1768 2.2105 1.4779 1.3883 1.3131 1.3218 1.3128 1.2711 1.9108 1.3623 1.8151 2.1581 9.0428 9.8966 1.1126 1.2825 2.2602 2.2285 1.8215 1.0495 1.0972 1.0837 2.1782 2.2753 7.4299 6.6357 7.9197 6.1116 6.0797 6.1288 10.8812 8.7221 6.0279 1.0363 1.0577 1.0653 1.0861 1.0974 1.0866 1.0892 1.1004 1.1041 1.1016 1.0854 1.0857 1.0886 1.0888 1.0926 1.0933 1.0962 1.0966 1.0943 1.1014 1.1004 1.0769
irintensity: 0.2012 0.1064 1.4017 0.8653 0.2191 0.9064 1.7876 1.1852 0.2659 2.8338 2.2183 0.2809 0.5507 1.4952 0.2131 0.2456 0.6468 0.8195 5.5786 3.7153 6.4857 0.6389 9.0027 5.5374 1.2222 13.1772 25.4848 0.3901 2.1089 10.1334 10.8817 0.1165 0.0197 3.0509 5.0208 2.0142 1.7820 10.7808 11.5716 8.6707 2.3406 3.4337 22.0188 4.2724 1.8498 0.7835 17.0082 5.9847 26.2888 62.2534 11.6940 50.9516 32.3232 2.5877 87.2679 4.4433 4.9622 15.7930 7.4279 117.2270 48.2089 2.4119 21.7093 2.9393 23.6250 0.2628 19.4546 0.7232 211.4564 20.1364 34.0288 31.6339 1.7190 49.1890 16.9845 15.8811 2.5672 0.3551 4.5454 0.9870 0.1911 1.0789 174.2000 77.9059 3.0663 87.8935 167.0324 19.7534 30.2230 111.8348 13.7041 10.7998 70.0443 8.8844 71.5564 5.3852 0.0787 44.3577 80.4942 28.4617 159.7763 31.8347 17.8902 272.5254 5.8950 214.1400 30.2168 30.9524 2.6550 1.7705 3.3390 0.7639 52.1018 2.5072 49.9139 30.6614 4.0365 2.8400 26.6732 9.5277 15.3065 14.5866 74.7065 12.0464 17.7728 3.7197 4.2367 7.8588 86.1519 31.4527 62.4086 16.4066 14.0137 224.8127 161.1564 333.4107 506.1688 18.1801 14.9973 3.6894 1.8948 12.4185 16.9851 4.6609 14.6710 5.3876 10.2959 0.6304 0.2013 5.9052 6.8553 14.1191 10.9848 12.9918 18.9661 13.3251 23.6664 11.4900 61.3637
temp: 298.150 k
press: 1.00000 atm
elementType: 16 8 8 8 8 8 8 7 7 6 6 6 6 6 6 6 6 6 6 6 6 6 6 6 6 6 6 6 6 6 6 6 6 1 1 1 1 1 1 1 1 1 1 1 1 1 1 1 1 1 1 1 1 1 1
symmnumber: 1
zpe: 1095554.8 jmol-1
zpe.correction: 0.417275 hartree
zpe.thermalcorrener: 0.446692 hartree
zpe.thermalcorrenthalpy: 0.447636 hartree
zpe.thermalcorrgfe: 0.351016 hartree
zpe.sumelectzpe: -1884.352861 hartree
zpe.sumelectthermal: -1884.323444 hartree
zpe.sumelectthermalent: -1884.322500 hartree
zpe.sumelectthermalfe: -1884.419120 hartree
dipole: 3.3921 5.0624 0.8406
dipole: 6.1515
quadrupole: -178.0756 -208.9466 -197.2519
quadrupole: -25.1331 14.2613 14.3288
quadrupole: 16.6824 -14.1885 -2.4938 -25.1331 14.2613 14.3288
hfenergy: -1884.7701361 hartree
pointgroup: C01 [X(C24H22N2O6S1)]
dipole: -1.2572876 -2.0339917 0.3733575 debye
polarizability: 364.2794899|-9.6907811|304.403674|8.7681029|-27.7581997|279.809622 unknown
InChI: InChI=1S/C24H22N2O6S/c1-15-13-26(24(30)25-21(15)27)20-12-18(32-22(28)16-8-4-2-5-9-16)19(31-20)14-33-23(29)17-10-6-3-7-11-17/h2-11,13,18-20,25H,12,14H2,1H3
charge 0 multiplicity 1
55 atoms
S  -3.393198 0.744511 -1.817537
O  -0.423676 1.336899 -0.650019
O  1.255977 -1.185817 -0.394224
O  1.559629 4.567788 -1.500418
O  2.754901 -2.312024 -1.783305
O  3.91987 4.399288 2.528869
O  -3.489649 -1.911158 -1.15536
N  1.632028 2.515058 -0.32884
N  2.720821 4.422514 0.526892
C  0.638567 -0.583751 -1.612154
C  -0.724666 -0.018718 -1.166134
C  1.422485 0.660575 -2.084358
C  0.775567 1.8673 -1.341075
C  -1.734317 0.017043 -2.327113
C  2.065863 1.798078 0.792321
C  1.938513 3.889363 -0.505369
C  2.838202 2.344135 1.78936
C  2.322673 -2.078849 -0.628292
C  3.21808 3.762201 1.690423
C  2.839276 -2.67586 0.632873
C  3.308927 1.568354 2.99457
C  -4.133138 -0.83126 -1.122583
C  -5.503069 -0.696023 -0.550619
C  3.98639 -3.508527 0.550265
C  2.220565 -2.442753 1.88977
C  4.5139 -4.098306 1.716342
C  2.751408 -3.038102 3.053108
C  -6.143157 -1.880575 -0.091351
C  -6.176955 0.549991 -0.446107
C  3.897996 -3.863852 2.969319
C  -7.438268 -1.817706 0.459267
C  -7.4729 0.607997 0.106346
C  -8.106461 -0.573687 0.559229
H  0.57663 -1.367236 -2.385425
H  -1.139476 -0.594152 -0.323412
H  1.30173 0.782218 -3.174504
H  2.500444 0.567298 -1.883184
H  0.484543 2.676937 -2.030538
H  -1.388272 0.641508 -3.167538
H  -1.941813 -1.011028 -2.671416
H  1.731172 0.758051 0.823523
H  2.963821 5.413447 0.427696
H  4.408752 1.621675 3.086328
H  3.010161 0.507958 2.932944
H  2.8980 2.001447 3.924922
H  4.443246 -3.678432 -0.43025
H  1.327112 -1.813789 1.94232
H  5.399861 -4.738628 1.651869
H  2.272108 -2.863385 4.022191
H  -5.608056 -2.83191 -0.176575
H  -5.691944 1.471764 -0.78581
H  4.307956 -4.3239 3.875214
H  -7.927443 -2.732593 0.810218
H  -7.987659 1.571104 0.186676
H  -9.113259 -0.524682 0.98855
