program: Gaussian 09
title: 000018085
version: EM64L-G09RevD.01
frameworkgroup: C1[X(C14H11Cl3)]
method: RPBEPBE
basis: SDD
operation: Freq
keyword: #p
keyword: freq=noraman
keyword: PBEPBE/SDD
title: #p freq=noraman PBEPBE/SDD
converged: YES YES NO NO
title: Mulliken charges:
elementType: Cl Cl Cl C C C C C C C C C C C C C C H H H H H H H H H H H
charge: 0.091673 0.096376 0.113084 -0.301216 0.516897 0.497898 -0.670102 -0.356014 -0.412665 -0.419943 -0.381521 -0.231896 -0.226313 -0.224511 -0.241004 -0.237981 -0.241943 0.272461 0.256233 0.228728 0.239272 0.257728 0.227879 0.228022 0.228848 0.227903 0.231034 0.231074
chargesum: 0.00000
title: Mulliken charges with hydrogens summed into heavy atoms:
elementType: Cl Cl Cl C C C C C C C C C C C C C C
charge: 0.091673 0.096376 0.113084 -0.028755 0.516897 0.497898 -0.670102 -0.099782 -0.183937 -0.180671 -0.123793 -0.004017 0.001709 0.004337 -0.013101 -0.006947 -0.010870
polarizability: 2.10170699e+02 3.96227116e+00 1.48708218e+02 1.27721241e+01 -6.94963475e+00 1.56683273e+02
1716.lowfreq: -7.9607 -3.9822 -0.0018 0.0007 0.0031 10.9014 27.5747 42.9365 61.4775
frequency: 27.3747 42.9218 61.4285 64.0786 81.0764 124.9999 185.0480 192.1327 222.0404 226.6050 244.4148 269.8508 280.9662 290.4569 356.1275 402.1504 404.8604 474.9265 484.8121 581.6899 587.5833 609.4981 616.3570 628.3822 698.3337 704.2679 705.1170 716.6885 753.9425 783.0001 825.0055 849.9142 855.5029 869.4113 923.1607 930.0728 975.3646 981.6475 989.2573 991.4000 996.3016 999.0469 1014.2363 1029.1517 1036.1223 1084.3313 1092.1411 1172.7949 1174.2407 1180.3538 1193.3485 1199.2325 1203.3290 1242.6086 1301.3705 1333.8832 1345.4898 1384.0817 1387.0193 1440.4329 1441.6316 1481.4844 1484.3346 1593.6351 1594.7805 1609.4575 1613.1953 3002.3902 3118.2626 3124.8613 3130.0587 3132.1776 3143.2891 3144.8591 3157.2968 3158.7109 3169.0181 3169.7431
redmass: 4.0164 6.2775 5.8232 5.7088 7.3169 7.6092 13.3212 10.8847 8.2854 5.4809 4.9225 11.1147 8.6620 8.1425 20.2943 2.8320 2.8054 3.6278 4.4007 6.5583 5.3825 5.3889 6.4983 6.8005 3.1715 1.8782 2.8559 3.3731 2.0066 2.3316 4.0385 1.2663 1.2515 3.8183 1.4857 1.4693 1.4017 1.4088 5.2052 5.8765 1.3800 1.3261 5.0859 2.2299 2.4221 1.6361 1.6247 1.1940 1.0661 2.1281 1.1134 1.2670 1.8138 1.6282 1.3865 1.2581 1.2623 6.3292 6.8801 2.1871 2.1313 2.2168 2.2091 6.0282 6.0314 6.0661 6.0385 1.0823 1.0874 1.0854 1.0869 1.0880 1.0928 1.0927 1.0956 1.0957 1.1006 1.0996
irintensity: 0.0386 0.0560 0.4406 0.0356 0.0609 0.2818 0.2188 0.4830 1.2967 1.7863 0.6875 1.0764 0.9983 1.1359 0.2959 0.2922 0.2613 5.2612 0.1759 51.3665 59.1962 47.2563 3.8761 35.8437 68.7108 19.7843 67.1612 106.7144 47.5794 9.4701 29.4404 0.9340 0.0833 10.3251 1.4343 6.3642 0.1312 0.3234 4.5551 1.3490 0.3227 0.4150 10.9939 10.3568 18.8126 3.3534 23.2575 0.6416 0.2375 1.4533 2.4745 0.5676 1.5445 4.2856 3.4569 4.0004 4.2238 0.2736 0.2539 18.2040 2.4459 17.8563 18.6502 2.8278 0.3995 4.3626 3.6509 4.4908 6.2987 2.5784 1.0064 2.1196 23.5395 23.4063 28.1264 20.7432 14.2477 16.3581
temp: 298.150 k
press: 1.00000 atm
elementType: 17 17 17 6 6 6 6 6 6 6 6 6 6 6 6 6 6 1 1 1 1 1 1 1 1 1 1 1
symmnumber: 1
zpe: 538861.3 jmol-1
zpe.correction: 0.205241 hartree
zpe.thermalcorrener: 0.220713 hartree
zpe.thermalcorrenthalpy: 0.221657 hartree
zpe.thermalcorrgfe: 0.160524 hartree
zpe.sumelectzpe: -1919.055605 hartree
zpe.sumelectthermal: -1919.040134 hartree
zpe.sumelectthermalent: -1919.039189 hartree
zpe.sumelectthermalfe: -1919.100322 hartree
dipole: 0.2772 -2.7010 -0.5952
dipole: 2.7796
quadrupole: -111.0305 -123.2415 -111.1135
quadrupole: 0.6297 3.4467 -0.9902
quadrupole: 4.0980 -8.1130 4.0150 0.6297 3.4467 -0.9902
hfenergy: -1919.2608464 hartree
pointgroup: C01 [X(C14H11Cl3)]
dipole: 0.0142643 1.0803346 0.1691061 debye
polarizability: 210.6115075|0.7780127|147.5447575|-11.6929769|-7.4767444|157.405925 unknown
InChI: InChI=1S/C14H11Cl3/c15-14(16,17)13(11-7-3-1-4-8-11)12-9-5-2-6-10-12/h1-10,13H
charge 0 multiplicity 1
28 atoms
Cl -0.316117 -2.320659 -1.730076
Cl -1.498559 -3.009645 0.945974
Cl 1.492352 -3.035551 0.592943
C  -0.012037 -0.646731 0.599729
C  -1.256628 0.166603 0.192398
C  1.293844 0.110294 0.300827
C  -0.067961 -2.121465 0.111639
C  -1.329065 0.838838 -1.053525
C  1.750375 1.007855 1.301001
C  -2.34307 0.277901 1.095639
C  2.025331 0.015311 -0.908635
C  -2.473766 1.590654 -1.394723
C  2.904975 1.79373 1.101249
C  -3.48691 1.034598 0.757926
C  3.185926 0.797135 -1.107382
C  -3.55753 1.690669 -0.491704
C  3.629898 1.691371 -0.108297
H  -0.053987 -0.762627 1.701072
H  -0.487614 0.788465 -1.751115
H  1.193675 1.094983 2.242446
H  -2.297815 -0.23427 2.06376
H  1.710392 -0.679331 -1.692484
H  -2.517758 2.103336 -2.361961
H  3.240069 2.478833 1.887786
H  -4.318263 1.111577 1.467195
H  3.744142 0.70304 -2.045589
H  -4.443625 2.278065 -0.756829
H  4.529728 2.295821 -0.266565
