program: Gaussian 09
title: 000250252
version: EM64L-G09RevD.01
frameworkgroup: C1[X(C9H12N2O)]
method: RPBEPBE
basis: SDD
operation: Freq
keyword: #p
keyword: freq=noraman
keyword: PBEPBE/SDD
title: #p freq=noraman PBEPBE/SDD
converged: YES YES NO NO
title: Mulliken charges:
elementType: O N N C C C C C C C C C H H H H H H H H H H H H
charge: -0.318264 -0.402446 -0.413036 -0.514430 0.483380 -0.444654 -0.367275 -0.217149 -0.225472 -0.242644 0.328439 -0.604054 0.219424 0.269788 0.281270 0.230294 0.251331 0.225195 0.225682 0.228133 0.286855 0.220333 0.219549 0.279751
chargesum: 0.00000
title: Mulliken charges with hydrogens summed into heavy atoms:
elementType: O N N C C C C C C C C C
charge: -0.318264 -0.121176 -0.126180 -0.025217 0.483380 -0.214360 -0.115944 0.008046 0.000211 -0.014511 0.328439 0.115577
polarizability: 1.56844084e+02 -5.35077193e+00 1.05066007e+02 -5.93547133e+00 2.88207467e+00 7.40188830e+01
1716.lowfreq: -9.5994 -6.3586 -0.0005 0.0006 0.0007 3.0345 13.6711 32.6630 56.4765
frequency: 13.1326 32.4518 56.4418 117.3324 136.3642 174.4817 189.4081 273.7135 279.4235 344.6183 373.3809 403.9096 452.7739 533.8256 541.2324 589.4493 617.0720 672.7204 704.9323 709.8898 753.7976 806.6437 854.5852 885.4955 917.9943 977.2270 989.6743 994.2928 1005.9227 1025.4767 1043.2957 1085.8179 1127.7187 1131.6460 1171.2166 1172.0477 1185.4987 1213.4405 1226.1274 1241.5535 1316.9772 1354.1648 1386.8450 1421.3629 1440.7440 1452.7596 1467.1959 1481.2031 1485.1288 1488.4700 1527.4567 1594.8309 1614.0221 1634.8470 2969.2744 2979.1761 3041.8551 3043.9384 3106.0275 3113.2800 3122.8200 3134.5632 3145.5630 3162.1661 3549.4750 3561.7964
redmass: 4.3210 3.9406 3.9416 1.3211 2.2745 3.4275 3.8236 3.8659 3.0545 1.8529 1.7848 2.8010 2.9990 2.8021 1.4464 3.7511 6.2401 4.2469 1.9492 7.0946 1.8475 3.7922 1.2478 2.5106 1.4674 1.3936 5.9113 1.3524 2.2666 2.2157 4.7293 1.5716 1.2731 1.5300 1.4079 1.9071 1.1143 2.4035 1.4696 1.4965 1.3197 1.4099 5.2181 1.1714 2.1129 1.4035 1.1852 1.4794 1.8050 1.0501 1.7615 6.0549 6.0304 4.9558 1.0357 1.0625 1.0983 1.1027 1.0969 1.0871 1.0860 1.0913 1.0962 1.1015 1.0775 1.0770
irintensity: 2.8380 0.9958 12.3039 0.0194 5.9637 1.1047 1.5343 0.9247 7.1159 24.1525 11.3642 0.8038 6.2993 71.4066 187.3790 37.9161 0.6485 8.7513 46.9664 14.7171 43.4172 13.4035 0.1967 6.6686 4.1048 0.1169 0.0720 0.7100 1.3805 10.2978 4.5578 11.9332 0.5150 40.9919 1.1297 3.1638 3.7289 11.8617 55.2130 248.6245 12.0430 3.6684 5.4933 35.0187 22.0458 29.0293 38.0537 138.2106 48.2174 20.9804 345.1639 1.5794 6.6414 172.4551 113.0732 45.0231 10.7984 47.6461 1.7364 9.3224 0.2857 14.6080 41.2901 22.8541 10.1466 12.0778
temp: 298.150 k
press: 1.00000 atm
elementType: 8 7 7 6 6 6 6 6 6 6 6 6 1 1 1 1 1 1 1 1 1 1 1 1
symmnumber: 1
zpe: 518114.4 jmol-1
zpe.correction: 0.197339 hartree
zpe.thermalcorrener: 0.209366 hartree
zpe.thermalcorrenthalpy: 0.210310 hartree
zpe.thermalcorrgfe: 0.156710 hartree
zpe.sumelectzpe: -534.008667 hartree
zpe.sumelectthermal: -533.996641 hartree
zpe.sumelectthermalent: -533.995696 hartree
zpe.sumelectthermalfe: -534.049297 hartree
dipole: 0.2005 0.1645 -4.1983
dipole: 4.2063
quadrupole: -62.8677 -66.2631 -74.0617
quadrupole: -3.1116 9.0148 1.7011
quadrupole: 4.8631 1.4677 -6.3309 -3.1116 9.0148 1.7011
hfenergy: -534.2060062 hartree
pointgroup: C01 [X(C9H12N2O1)]
dipole: 0.0271289 -0.5284399 -1.5680182 debye
dipolederiv: -0.7991794 0.1026862 0.0125004 0.1786801 -0.4800123 -0.2155398 0.0158093 -0.1793146 -0.9835406 -1.5303751 0.197106 0.0554389 0.3439011 -0.6554872 0.0365489 0.1532358 0.0038558 -0.2920388 -1.2468655 0.1050734 -0.2979221 0.1793339 -0.5089824 0.155895 -0.5239033 0.198499 -0.586774 0.6048969 -0.0069798 0.1131147 0.0898566 0.3397727 -0.111484 0.4780709 -0.1317215 0.1623006 0.1692529 0.0736383 -0.1079151 0.0969169 -0.0519426 0.0052909 -0.1719217 0.0095129 -0.0235821 -0.1743515 -0.0249468 -0.0023657 -0.0397836 0.0769492 -0.059065 -0.0114725 -0.0682014 -0.1540636 -0.0486837 -0.0834895 -0.0086474 -0.1582431 -0.0546826 0.0035604 0.0226599 0.0130403 -0.1524373 0.0666546 -0.0765673 -0.0409487 -0.0984189 0.00475 -0.0149168 -0.0148999 -0.0169936 -0.1373359 -0.0275478 -0.0055468 -0.0254097 0.0102329 0.1215506 -0.0600901 -0.0308324 -0.0577915 -0.1322185 0.0078673 0.055024 -0.0663455 0.0597992 -0.0589071 -0.0395265 -0.054317 -0.0404012 -0.150088 2.0959566 -0.5461309 0.2459605 -0.7873408 0.5963985 0.2555834 0.3075877 0.1947348 1.3381649 0.5797402 -0.0906269 0.0432027 -0.2012647 0.3227411 -0.135499 -0.1711024 -0.047235 0.0030968 -0.0556394 0.0824989 -0.0444104 0.0392406 -0.1710121 0.0810798 -0.073588 0.0296728 0.0832352 0.1078436 -0.0351177 0.0703606 -0.0746918 0.0876986 -0.0560953 -0.0539957 -0.0117718 0.0332304 0.1737575 0.0975377 -0.031535 0.1275671 0.2845109 -0.038557 -0.0651729 -0.0521511 0.0565839 0.0987382 -0.0369964 0.0225 -0.0073625 -0.1113761 0.061375 0.0106204 0.0662525 0.133383 -0.0143823 0.0928878 0.0220543 0.1088637 0.0499008 0.0077872 0.0275081 0.0030739 0.1324285 -0.0818804 0.1011432 0.0276363 0.1102345 0.0209301 0.0058438 0.0347349 0.0072144 0.1496162 0.0760044 -0.0031303 0.017037 -0.0261408 -0.1172716 0.0634619 0.0160951 0.0623589 0.1364837 -0.0831739 -0.074311 0.0718917 -0.0788494 0.0536012 0.0430555 0.0778537 0.0438277 0.1362383 0.1473103 0.1197007 0.0005423 0.1249995 0.2534074 -0.0990016 0.019246 -0.0955812 0.1121093 -0.2230126 -0.0543761 -0.0383275 -0.125259 -0.0253438 -0.0058495 -0.0257964 -0.010371 0.1194435 -0.0243396 0.0377403 -0.0074605 0.1251203 -0.0889599 0.1476318 -0.045275 0.1605024 0.003152 0.1814086 -0.026817 -0.0309519 0.0026078 0.1117667 -0.031489 0.0788553 -0.0810112 0.0126125 unknown
polarizability: 156.119744|-8.9956095|103.5739658|-5.6875276|-7.8347663|76.2352644 unknown
InChI: InChI=1S/C9H12N2O/c1-10-9(12)11-7-8-5-3-2-4-6-8/h2-6,10-11H,7H2,1H3
charge 0 multiplicity 1
24 atoms
O  -2.516419 0.302769 1.394182
N  -1.270992 -0.8972 -0.186569
N  -3.373607 -0.013566 -0.764515
C  -0.147628 -1.14283 0.72843
C  1.16288 -0.517387 0.256724
C  2.342577 -1.295099 0.160983
C  1.221403 0.861176 -0.075556
C  3.561489 -0.710307 -0.25636
C  2.435459 1.447471 -0.493289
C  3.610893 0.662997 -0.58544
C  -2.396583 -0.173137 0.220516
C  -4.611378 0.722448 -0.495912
H  -0.0093 -2.231397 0.881961
H  -0.462923 -0.707918 1.695721
H  -1.171826 -1.197606 -1.157063
H  2.308607 -2.362332 0.415432
H  0.311752 1.468432 0.002503
H  4.466817 -1.324115 -0.325868
H  2.469669 2.514482 -0.741606
H  4.553483 1.118607 -0.909276
H  -3.247522 -0.442169 -1.681548
H  -5.502295 0.0721 -0.587347
H  -4.726695 1.586982 -1.176843
H  -4.551458 1.092804 0.540138
