program: Gaussian 09
title: 000250246
version: EM64L-G09RevD.01
frameworkgroup: C1[X(C9H9ClN2O)]
method: RPBEPBE
basis: SDD
operation: Freq
keyword: #p
keyword: freq=noraman
keyword: PBEPBE/SDD
title: #p freq=noraman PBEPBE/SDD
converged: YES YES NO NO
title: Mulliken charges:
elementType: Cl O N N C C C C C C C C C H H H H H H H H H
charge: -0.072238 -0.278270 -0.331525 -0.139024 0.248687 0.062254 0.183315 -0.356172 -0.355418 -0.331478 -0.552642 -0.220478 -0.218955 0.271116 0.250264 0.334757 0.250342 0.248189 0.283711 0.268786 0.228837 0.225943
chargesum: 0.00000
title: Mulliken charges with hydrogens summed into heavy atoms:
elementType: Cl O N N C C C C C C C C C
charge: -0.072238 -0.278270 0.003232 -0.139024 0.248687 0.062254 0.183315 0.165207 -0.105076 -0.083290 -0.000145 0.008359 0.006988
polarizability: 1.94819610e+02 -5.04959589e+00 1.15628452e+02 1.47690988e+01 -1.94288706e+00 6.15780061e+01
1716.lowfreq: -3.7380 -0.0007 0.0013 0.0013 0.4764 3.5821 10.9822 50.3391 81.0248
frequency: 4.0679 50.2904 81.0238 125.4053 152.5824 241.3582 256.2802 323.0859 353.4959 419.4523 434.0845 467.0277 514.1982 556.6038 572.2913 605.9277 608.7097 667.0920 687.6400 741.0330 754.0857 793.6761 844.2474 854.7217 865.9594 904.2027 929.6030 972.2057 975.2674 1003.8127 1024.1088 1086.3984 1106.1792 1138.1126 1159.7782 1169.6857 1182.9668 1242.4185 1252.8431 1281.1796 1305.1801 1368.6488 1400.7376 1440.9485 1443.0541 1448.1583 1455.2612 1480.0727 1587.6362 1623.9069 1667.1147 3007.2466 3061.3484 3072.9686 3136.5178 3153.7605 3154.7590 3171.8635 3179.8483 3577.2961
redmass: 7.0114 6.9329 4.4401 5.1737 4.9356 6.2864 3.4025 6.4459 2.8418 2.8471 3.3703 2.0441 1.8436 5.4801 3.7214 4.6894 6.9535 10.0037 4.7853 3.0707 1.4769 4.5873 4.0511 1.3745 4.6158 3.1537 1.3795 1.2965 2.4799 2.0396 1.6605 2.4714 3.8123 1.9319 1.1963 1.3496 2.2988 2.1245 1.5945 1.5705 1.1728 1.2991 3.7012 1.1014 3.7876 1.0992 2.5502 1.6450 7.1824 7.9550 9.7074 1.0602 1.0669 1.0931 1.0860 1.1118 1.0913 1.0955 1.0991 1.0771
irintensity: 0.9040 3.7075 5.9042 0.5871 4.5685 1.1228 4.7241 1.0667 9.2222 15.7941 2.1167 48.8876 94.2698 8.2307 1.4302 30.0320 0.3086 1.9744 36.2984 18.8421 102.8293 6.3958 9.2727 0.3784 9.2102 30.4600 5.4536 0.0522 30.2759 18.7200 6.0991 4.0572 4.5220 55.9589 1.1076 2.0722 23.2167 141.4239 27.3957 15.8426 32.7777 26.4180 0.2123 8.5177 74.8950 28.8561 6.3603 41.1418 246.4360 6.2997 641.5274 41.9498 11.1986 9.7718 4.1285 16.8690 15.4347 14.1616 10.1988 103.2620
temp: 298.150 k
press: 1.00000 atm
elementType: 17 8 7 7 6 6 6 6 6 6 6 6 6 1 1 1 1 1 1 1 1 1
symmnumber: 1
zpe: 437470.9 jmol-1
zpe.correction: 0.166624 hartree
zpe.thermalcorrener: 0.177948 hartree
zpe.thermalcorrenthalpy: 0.178892 hartree
zpe.thermalcorrgfe: 0.125749 hartree
zpe.sumelectzpe: -992.204254 hartree
zpe.sumelectthermal: -992.192930 hartree
zpe.sumelectthermalent: -992.191986 hartree
zpe.sumelectthermalfe: -992.245129 hartree
dipole: 0.3732 0.6405 0.3416
dipole: 0.8162
quadrupole: -78.2995 -78.2152 -84.9813
quadrupole: 6.8897 4.6156 -1.4654
quadrupole: 2.1991 2.2835 -4.4826 6.8897 4.6156 -1.4654
hfenergy: -992.3708779 hartree
pointgroup: C01 [X(C9H9Cl1N2O1)]
dipole: -0.1653769 0.2500098 -0.1152148 debye
dipolederiv: -0.4076818 -0.1378307 0.085151 -0.233144 -0.4045211 0.0825986 0.0765701 0.0102838 -0.227768 -1.1533389 0.0971399 -0.0637165 0.209207 -0.5934617 -0.0419863 -0.0977195 -0.0435573 -0.133438 -2.010105 -0.0445779 -0.0309197 -0.0671254 -0.300388 -0.0479572 -0.2000254 -0.044935 -0.5548551 -1.3617689 -0.1346234 -0.081526 -0.6055711 -0.5247496 -0.0657153 -0.1566685 -0.0370189 -0.2859293 0.4553864 0.0369035 0.0502568 0.6308782 0.051988 0.0495036 0.10675 0.0034425 0.0650151 0.9600472 0.0239398 0.0774222 -0.3298393 -0.0380593 -0.0373164 0.0613005 -0.005742 0.0306009 2.507932 0.1235044 0.1553061 0.5566919 0.8364838 0.1140538 0.3355652 0.0959123 0.2245792 0.5831075 -0.2146943 0.0083961 -0.7849129 0.0943336 0.0371711 -0.0103423 0.0053303 0.247237 0.0958314 -0.0194767 0.0200437 -0.0503343 0.0546095 0.0194078 0.0234693 0.0201488 -0.1539404 -0.1174838 0.0211232 0.0094497 -0.0548811 0.1090402 0.0203823 0.0000714 0.0295243 -0.1595255 0.3971561 0.2775557 -0.054993 0.4491406 0.5220363 -0.0566693 -0.0729039 -0.0888422 0.13615 -0.1277921 -0.0244568 0.0122831 -0.1249882 -0.0210676 0.0073235 -0.0058549 0.0155886 -0.1931734 0.018056 0.032715 0.0263602 0.1639545 0.0209194 0.0326822 0.0343853 0.0227717 -0.165655 0.1242062 -0.0967641 0.0382714 0.0288926 0.0323443 -0.0151586 0.0748316 0.0146552 0.0986637 -0.1138278 0.0544813 -0.0918676 0.0997065 0.1021079 -0.0492894 -0.0890452 0.0042554 -0.0555667 0.21751 0.0149495 -0.0315817 0.1510875 0.184685 0.0126713 -0.0148517 0.0387906 0.3815976 0.0940007 0.0008893 -0.0090716 0.0255582 -0.0572078 -0.0228311 -0.0070061 -0.0242349 0.1795669 0.0934563 0.0309226 -0.005472 0.0015894 -0.0676304 -0.0231272 -0.0074891 -0.0212713 0.1662428 0.0199936 -0.068156 -0.086317 -0.0903093 0.0122914 0.017519 -0.0542679 0.0122023 -0.0273835 -0.1039935 0.041047 0.0234269 0.0473582 -0.0898494 -0.0050435 0.0578384 0.020551 0.1012342 -0.0937801 0.0815208 -0.0176368 0.0790874 0.0495177 -0.0040724 -0.0192417 -0.0038978 0.1677614 -0.0769117 -0.0961121 -0.0332654 -0.1020464 0.0265776 -0.0241465 -0.0353655 -0.0239574 0.1585861 unknown
polarizability: 195.7060429|8.0603401|115.9509916|5.6286306|3.7456725|60.3690333 unknown
InChI: InChI=1S/C9H9ClN2O/c10-5-6-11-9-12-7-3-1-2-4-8(7)13-9/h1-4,11H,5-6H2
charge 0 multiplicity 1
22 atoms
Cl -5.025341 -0.924257 0.917109
O  0.020965 -1.331498 -0.311681
N  -2.153059 -0.412288 -0.466913
N  -0.200995 0.986258 -0.091095
C  1.32271 -0.777305 -0.117823
C  1.175371 0.634425 0.010567
C  -0.822244 -0.174751 -0.279187
C  -3.13489 0.673715 -0.418036
C  2.543641 -1.450358 -0.0567
C  2.319222 1.432271 0.211391
C  -3.982518 0.661263 0.856062
C  3.687478 -0.633509 0.145416
C  3.573321 0.776671 0.276042
H  -2.574268 1.625636 -0.458432
H  -3.794388 0.622712 -1.303898
H  -2.477345 -1.378962 -0.50731
H  2.617778 -2.53623 -0.158969
H  2.233712 2.517918 0.312733
H  -3.37091 0.646113 1.769225
H  -4.708682 1.487549 0.873877
H  4.675199 -1.102981 0.200605
H  4.479944 1.371709 0.430816
