program: Gaussian 09
title: 000254141
version: EM64L-G09RevD.01
frameworkgroup: C1[X(C17H13N)]
method: RPBEPBE
basis: SDD
operation: Freq
keyword: #pfreq=noraman
keyword: PBEPBE/SDD
title: #p freq=noraman PBEPBE/SDD
converged: YES YES NO YES
title: Mulliken charges:
elementType: N C C C C C C C C C C C C C C C C C H H H H H H H H H H H H H
charge: -0.066002 0.412748 -0.091888 0.201626 -0.321216 -0.339787 -0.389841 -0.329487 -0.338019 0.484660 -0.252203 -0.308886 -0.222607 -0.383332 -0.397243 -0.238683 -0.238976 -0.241480 0.241894 0.229681 0.233592 0.261331 0.220658 0.271782 0.229532 0.230872 0.224082 0.234217 0.225499 0.227612 0.229863
chargesum: 0.00000
title: Mulliken charges with hydrogens summed into heavy atoms:
elementType: N C C C C C C C C C C C C C C C C C
charge: -0.066002 0.412748 -0.091888 0.201626 -0.079321 -0.110107 -0.156248 -0.068156 -0.117361 0.484660 -0.022671 -0.037104 0.008265 -0.159250 -0.163026 -0.013184 -0.011364 -0.011616
polarizability: 4.40822468e+02 -4.19342170e+00 1.99256928e+02 1.11847614e-02 -6.38524645e-04 7.13367416e+01
1716.lowfreq: -7.7844 -1.9496 -0.0009 -0.0003 0.0007 4.9591 28.0166 40.9742 55.0794
frequency: 28.0157 40.9681 55.0690 93.8371 156.9088 161.9972 180.4614 245.1829 259.8608 320.2883 374.0224 401.3186 402.4341 474.8657 476.4804 494.9058 501.2410 518.5845 547.0013 596.6582 614.6928 622.3720 681.3185 696.1067 737.7153 757.1282 763.9455 772.8886 797.8363 835.5156 835.5830 845.4595 881.1217 896.3421 910.7533 923.4285 961.3534 963.2716 976.6102 984.2165 987.6838 992.2772 994.2458 1008.2034 1016.2956 1025.7036 1082.8188 1113.9912 1148.0785 1165.9506 1172.5131 1185.6530 1190.5073 1216.3513 1236.8913 1252.2019 1297.1865 1306.3488 1323.4326 1337.0413 1359.3419 1385.5131 1404.0948 1418.6203 1439.7077 1457.4297 1485.0971 1503.0071 1540.1119 1580.5605 1589.2267 1609.8979 1618.7937 1646.9245 3103.1204 3112.3353 3120.2427 3121.6470 3124.9690 3126.0411 3135.1339 3138.5810 3148.4172 3150.4898 3154.7687 3164.9512 3169.3151
redmass: 3.7845 5.2376 5.0772 4.3342 3.3920 5.5117 3.8634 5.7337 2.6085 4.7359 4.4797 3.3486 2.7718 2.9573 6.0779 2.8890 4.9747 6.5776 3.3471 6.5644 6.5429 6.8873 2.9790 1.6753 5.6820 1.3779 5.6680 1.6999 3.0522 1.4527 4.5544 1.2804 1.7056 1.7878 5.3287 1.5056 1.3594 4.6501 1.3845 1.3884 6.1527 1.2958 1.3334 1.2076 2.1419 2.1960 1.6237 1.7168 1.2557 1.1080 1.0633 1.8328 1.2536 1.4297 2.1197 1.7022 1.8935 2.2461 1.8535 1.5137 3.5411 6.3864 4.4336 2.4176 2.3254 3.0032 2.3679 3.4920 7.0635 5.6676 6.4036 5.9643 6.1533 5.9758 1.0928 1.0867 1.0872 1.0853 1.0874 1.0869 1.0890 1.0916 1.0964 1.0983 1.0948 1.1016 1.0994
irintensity: 0.0698 1.6196 0.2378 0.0062 0.9630 0.1076 4.2462 0.6829 0.5651 0.0795 1.2105 1.7787 0.0286 5.1075 18.9920 13.7538 0.8973 0.0166 1.5326 3.7475 1.2854 4.5781 2.4693 44.5644 1.4392 103.2339 1.4399 0.0232 4.2018 63.3306 0.1833 6.3231 0.2121 26.1145 1.7671 0.3921 2.5518 0.7340 0.7344 4.2345 0.2256 7.6098 0.1585 42.6125 7.8967 4.9216 10.9496 7.1059 1.7725 6.5312 0.4120 14.0297 16.1445 9.8906 5.7786 2.3867 9.0296 8.4647 1.7914 26.2895 5.5312 6.8246 2.5002 24.2269 13.2261 9.4012 14.1623 69.3436 56.6209 9.1400 112.4705 8.2267 26.7626 28.8515 4.8369 18.7175 6.9000 8.1552 10.1955 2.3318 11.2337 5.4295 37.9004 30.9541 31.4868 43.0738 27.1886
temp: 298.150 k
press: 1.00000 atm
elementType: 7 6 6 6 6 6 6 6 6 6 6 6 6 6 6 6 6 6 1 1 1 1 1 1 1 1 1 1 1 1 1
symmnumber: 1
zpe: 643886.8 jmol-1
zpe.correction: 0.245244 hartree
zpe.thermalcorrener: 0.259124 hartree
zpe.thermalcorrenthalpy: 0.260068 hartree
zpe.thermalcorrgfe: 0.202952 hartree
zpe.sumelectzpe: -709.147461 hartree
zpe.sumelectthermal: -709.133580 hartree
zpe.sumelectthermalent: -709.132636 hartree
zpe.sumelectthermalfe: -709.189752 hartree
dipole: 0.4923 1.3536 0.0011
dipole: 1.4403
quadrupole: -80.8515 -88.5000 -113.6491
quadrupole: 1.1902 0.0042 -0.0033
quadrupole: 13.4821 5.8335 -19.3156 1.1902 0.0042 -0.0033
hfenergy: -709.3927044 hartree
pointgroup: C01 [X(C17H13N1)]
dipole: 0.1939906 0.5323857 -0.0067098 debye
polarizability: 440.802422|-4.2884097|199.2291145|2.4494099|-2.0390157|71.3846004 unknown
InChI: InChI=1S/C17H13N/c1-2-6-14(7-3-1)10-12-16-13-11-15-8-4-5-9-17(15)18-16/h1-13H
charge 0 multiplicity 1
31 atoms
N  1.203025 -0.399575 0.018296
C  3.4359 0.699949 0.016158
C  2.583597 -0.475972 0.028569
C  0.618037 0.828127 -0.004455
C  2.78724 1.978419 -0.008058
C  1.3973 2.044054 -0.018379
C  4.857436 0.538865 0.028334
C  3.194963 -1.773047 0.052531
C  -0.850071 0.917928 -0.01556
C  -3.146152 -0.1788 -0.012359
C  5.424727 -0.738304 0.051837
C  -1.677367 -0.174162 -0.002945
C  4.585943 -1.899893 0.063946
C  -3.938189 1.00832 -0.036353
C  -3.823575 -1.433384 0.00338
C  -5.34436 0.938531 -0.044296
C  -5.231993 -1.50424 -0.004664
C  -6.000669 -0.317553 -0.02852
H  3.393223 2.892064 -0.018269
H  0.879323 3.009033 -0.037042
H  5.495445 1.431224 0.018966
H  2.534076 -2.645275 0.061467
H  -1.262329 1.935458 -0.034912
H  -1.179784 -1.15392 0.016646
H  6.51363 -0.857732 0.061042
H  5.044962 -2.894615 0.082352
H  -3.45106 1.989747 -0.048962
H  -3.229947 -2.355704 0.021981
H  -5.935131 1.86145 -0.062829
H  -5.729774 -2.480231 0.007808
H  -7.095126 -0.36766 -0.034813
