program: Gaussian 09
title: 000254143
version: EM64L-G09RevD.01
frameworkgroup: C1[X(C13H11NO4)]
method: RPBEPBE
basis: SDD
operation: Freq
keyword: #p
keyword: freq=noraman
keyword: PBEPBE/SDD
title: #p freq=noraman PBEPBE/SDD
converged: YES YES NO NO
title: Mulliken charges:
elementType: O O O O N C C C C C C C C C C C C C H H H H H H H H H H H
charge: -0.258087 -0.261137 -0.220840 -0.179306 0.011525 0.199303 0.293696 0.230234 0.239881 -0.333406 -0.305677 -0.337527 -0.326726 -0.226757 -0.226595 -0.232456 -0.231323 -0.533850 0.265514 0.264929 0.245177 0.282061 0.235071 0.234556 0.229399 0.239445 0.229070 0.220255 0.253571
chargesum: 0.00000
title: Mulliken charges with hydrogens summed into heavy atoms:
elementType: O O O O N C C C C C C C C C C C C C
charge: -0.258087 -0.261137 -0.220840 -0.179306 0.011525 0.199303 0.293696 0.230234 0.239881 -0.067892 -0.040748 -0.092350 -0.044666 0.008314 0.007961 -0.003056 0.008122 0.169047
polarizability: 2.21694766e+02 1.41987051e+01 1.55097585e+02 1.98666852e+01 1.39944597e-01 1.23538489e+02
1716.lowfreq: -6.7346 -3.0801 -0.0007 -0.0006 0.0008 6.0838 23.2307 28.6416 44.2654
frequency: 23.1987 28.6090 44.2359 63.5257 95.9517 123.4162 149.5710 170.7632 195.7930 222.5504 244.3363 294.4557 306.1932 321.5462 366.4751 416.5309 449.9477 494.6881 505.1121 512.6412 538.9063 549.4494 580.8754 617.6636 643.5995 666.3777 708.9323 726.3071 737.4634 753.3144 763.1662 772.1875 792.8096 844.6621 860.4000 869.2000 929.9872 960.2748 971.9310 983.9082 985.8405 1035.2365 1037.9267 1064.3538 1095.3659 1111.6674 1140.7531 1147.0552 1166.5143 1170.1839 1176.4850 1204.1751 1220.1956 1251.9580 1263.0968 1268.9645 1364.5863 1381.4287 1391.8238 1427.7448 1438.2004 1443.0226 1464.8974 1466.9636 1468.5755 1484.9918 1582.4070 1587.8059 1603.5602 1613.1618 2966.1505 3057.3350 3133.8608 3139.2600 3141.2641 3155.4843 3158.8515 3165.8973 3169.2952 3178.5636 3185.3019
redmass: 6.2116 6.1917 8.6471 4.9936 3.3336 4.2878 4.6877 3.7415 5.0081 1.3784 4.3998 4.0435 7.6499 5.4673 8.8059 3.9747 3.6728 4.5481 5.8898 4.6697 4.4338 5.2787 7.1673 5.2613 7.3111 5.2569 5.0764 3.9074 4.3623 1.7377 2.7564 1.4412 6.7850 1.4533 2.5494 2.1819 1.3696 1.3632 1.3068 8.1152 1.3450 2.0735 2.4692 3.7664 2.5231 1.2569 1.7052 1.5529 1.2336 1.1266 1.4527 4.8030 4.4996 3.0251 1.6722 1.5197 7.9526 9.1730 7.3098 1.4916 2.6051 1.6875 2.1994 1.0538 1.2442 2.1673 6.9314 7.0842 6.8225 6.9729 1.0327 1.1043 1.0996 1.0860 1.0865 1.0898 1.0905 1.0944 1.0956 1.1003 1.0982
irintensity: 0.7523 1.1464 0.5707 2.2194 4.9534 0.3886 2.1704 0.3527 0.2900 0.2157 0.2780 0.0784 0.8938 5.4913 0.3960 0.8422 6.0578 0.7798 9.0650 3.6282 0.7962 1.0604 1.2121 2.0188 9.9789 7.7562 3.4214 21.7767 13.0809 88.6153 29.8206 61.0955 16.1254 0.0159 13.2804 7.7028 2.9560 3.8867 0.0591 41.4229 1.1007 13.0468 8.1076 17.4318 75.4857 0.0724 0.5438 27.3769 23.4993 31.0135 17.0440 323.0323 128.1584 195.2576 44.1830 10.9206 99.4223 21.7902 8.6052 7.4926 13.4834 39.9014 121.6546 12.7869 147.6081 90.5045 35.1113 14.3207 40.1927 53.2554 57.8688 37.4524 14.7625 1.1023 3.9123 12.3111 9.0172 15.1430 6.7483 10.4777 8.2402
temp: 298.150 k
press: 1.00000 atm
elementType: 8 8 8 8 7 6 6 6 6 6 6 6 6 6 6 6 6 6 1 1 1 1 1 1 1 1 1 1 1
symmnumber: 1
zpe: 561115.4 jmol-1
zpe.correction: 0.213718 hartree
zpe.thermalcorrener: 0.229471 hartree
zpe.thermalcorrenthalpy: 0.230415 hartree
zpe.thermalcorrgfe: 0.168560 hartree
zpe.sumelectzpe: -856.225701 hartree
zpe.sumelectthermal: -856.209947 hartree
zpe.sumelectthermalent: -856.209003 hartree
zpe.sumelectthermalfe: -856.270858 hartree
dipole: -4.7568 5.7546 -1.8409
dipole: 7.6897
quadrupole: -95.7113 -102.6609 -98.9309
quadrupole: 8.1501 -10.2501 7.8963
quadrupole: 3.3897 -3.5599 0.1701 8.1501 -10.2501 7.8963
hfenergy: -856.4394182 hartree
pointgroup: C01 [X(C13H11N1O4)]
dipole: 1.8638014 2.1410143 1.0464604 debye
polarizability: 200.7556977|-16.0032178|157.5815895|42.7160091|-9.9926714|141.9935524 unknown
InChI: InChI=1S/C13H11NO4/c1-17-12-8-4-5-9-13(12)18-11-7-3-2-6-10(11)14(15)16/h2-9H,1H3
charge 0 multiplicity 1
29 atoms
O  -0.085553 -0.975063 0.26151
O  1.661012 0.697924 -1.072794
O  -3.325665 -1.005163 -2.304354
O  -2.050574 -2.328922 -0.955099
N  -2.522527 -1.181881 -1.300323
C  1.244303 -0.80455 0.739113
C  -0.970528 0.10455 0.258405
C  -2.171226 0.013958 -0.504143
C  2.175841 0.002756 0.023102
C  1.65105 -1.573675 1.841203
C  -0.726427 1.287993 0.998981
C  3.522234 0.04026 0.458826
C  -3.087775 1.091972 -0.533056
C  2.999092 -1.534811 2.268949
C  -1.652159 2.346916 0.982503
C  3.926157 -0.725543 1.577714
C  -2.838502 2.256243 0.213153
C  2.598427 1.477688 -1.888052
H  0.90698 -2.201979 2.339923
H  0.193418 1.364277 1.586527
H  4.257546 0.65098 -0.073389
H  -3.98334 0.984859 -1.150908
H  3.316489 -2.134615 3.127314
H  -1.447063 3.247145 1.571722
H  4.972211 -0.690924 1.900381
H  -3.556821 3.081164 0.198923
H  3.388254 0.829945 -2.313877
H  3.05851 2.295195 -1.300214
H  1.985435 1.900005 -2.696841
