program: Gaussian 09
title: 000254125
version: EM64L-G09RevD.01
frameworkgroup: C1[X(C12H8N2O)]
method: RPBEPBE
basis: SDD
operation: Freq
keyword: #p
keyword: freq=noraman
keyword: PBEPBE/SDD
title: #p freq=noraman PBEPBE/SDD
converged: NO YES NO YES
title: Mulliken charges:
elementType: O N N C C C C C C C C C C C C H H H H H H H H
charge: -0.264719 -0.057383 -0.009702 0.077102 0.306168 0.313807 0.041123 -0.347012 -0.362875 -0.299297 -0.410417 -0.225554 -0.223409 -0.319008 -0.229987 0.263418 0.272342 0.255215 0.267184 0.233180 0.235005 0.249582 0.235236
chargesum: 0.00000
title: Mulliken charges with hydrogens summed into heavy atoms:
elementType: O N N C C C C C C C C C C C C
charge: -0.264719 -0.057383 -0.009702 0.077102 0.306168 0.313807 0.041123 -0.083594 -0.090532 -0.044082 -0.143234 0.007626 0.011596 -0.069427 0.005249
polarizability: 2.73471441e+02 6.61121112e-01 1.40634985e+02 7.30583560e-03 1.47672028e-04 5.52823804e+01
1716.lowfreq: -6.0512 -4.0537 0.0002 0.0004 0.0007 6.0175 53.5598 63.0815 100.5169
frequency: 53.5481 63.0759 100.5149 177.9659 246.8502 281.5777 311.5950 317.1622 401.2130 409.8495 489.4655 520.8770 558.3311 602.3883 610.6517 619.5732 683.5167 684.6065 697.5176 766.9517 784.0600 789.9122 823.6306 831.9477 860.1203 863.2952 914.9831 946.2716 947.1770 962.2261 988.6322 991.7746 1003.1742 1007.1098 1028.0690 1085.2587 1148.3108 1175.8336 1178.4058 1187.2080 1197.1386 1262.9017 1297.6620 1319.4090 1324.2501 1386.4978 1414.2163 1425.0770 1440.1268 1464.8915 1531.1749 1577.0976 1591.8419 1602.7170 1620.8883 3132.9503 3144.1475 3146.4744 3156.9032 3158.2267 3167.0725 3175.2658 3184.6565
redmass: 4.1622 6.6044 5.2344 5.3230 6.8099 6.9639 5.3235 5.3823 2.8306 2.9703 3.7506 8.0809 9.0392 4.9463 6.8897 7.4171 5.9920 6.7701 1.7849 4.6153 1.9039 7.2703 1.3499 9.9361 1.2473 8.4733 1.4327 1.4170 1.4335 8.7084 6.2606 1.3840 2.1015 1.3315 2.0770 1.5959 3.8233 1.0712 2.5522 1.2388 2.2488 4.4522 1.4815 2.6816 1.8567 8.5196 2.4226 2.2113 2.3443 2.3852 6.9413 6.8676 7.0591 8.5324 6.5347 1.0855 1.0890 1.0895 1.0935 1.0938 1.0963 1.1007 1.0973
irintensity: 0.7176 0.2546 0.4421 0.2248 0.2720 0.2089 2.4895 0.8567 0.0465 2.9427 6.6654 1.3970 2.0622 5.3158 0.4873 1.6776 20.4492 4.8695 56.0461 3.6026 51.8303 60.4431 54.2704 18.6250 0.0004 14.4241 4.7003 5.7949 0.0094 49.8761 0.5578 0.0082 7.0994 0.3573 4.5129 7.9634 15.9328 0.3929 9.8156 19.0082 15.2499 9.7645 1.2513 4.1434 13.6937 0.9956 16.0783 34.2338 18.3706 63.7280 22.3633 35.5215 22.1552 6.3775 28.2985 0.1885 9.9741 15.5354 17.3007 4.8789 13.1975 17.1450 7.1105
temp: 298.150 k
press: 1.00000 atm
elementType: 8 7 7 6 6 6 6 6 6 6 6 6 6 6 6 1 1 1 1 1 1 1 1
symmnumber: 1
zpe: 447620.0 jmol-1
zpe.correction: 0.170489 hartree
zpe.thermalcorrener: 0.181174 hartree
zpe.thermalcorrenthalpy: 0.182118 hartree
zpe.thermalcorrgfe: 0.133116 hartree
zpe.sumelectzpe: -645.778277 hartree
zpe.sumelectthermal: -645.767593 hartree
zpe.sumelectthermalent: -645.766649 hartree
zpe.sumelectthermalfe: -645.815651 hartree
dipole: 3.1521 2.1179 0.0002
dipole: 3.7975
quadrupole: -81.1563 -78.7048 -90.3727
quadrupole: -7.8525 0.0007 -0.0004
quadrupole: 2.2549 4.7065 -6.9614 -7.8525 0.0007 -0.0004
hfenergy: -645.9487666 hartree
pointgroup: C01 [X(C12H8N2O1)]
dipole: 1.2447153 0.826387 0.0000752 debye
dipolederiv: -0.9502482 0.1709023 -0.0000213 0.1683911 -0.5606711 0.0000134 -0.000054 0.0000357 -0.114393 -0.7663494 -0.1292027 -0.0000159 -0.2911724 -0.3946548 -0.0000013 -0.0000852 -0.0000231 -0.2219633 -0.5465268 0.0092519 -0.0000138 0.2697575 -0.357844 0.0000196 -0.0000026 -0.0000053 -0.2463442 1.2913101 -0.022684 0.0000808 -0.1525165 0.6988566 -0.0000216 0.0000396 -0.0000158 0.1020871 0.476389 -0.0636243 -0.0000284 0.3089225 0.0995148 0.0000091 -0.0000076 0.0000041 0.1092284 -0.2478481 0.0032916 -0.0000174 0.0418635 -0.0212524 0.000002 0.0000581 0.0000026 0.0126404 0.2788572 -0.0711264 0.000001 -0.2557193 -0.1318176 -0.0000062 0.0000516 -0.0000023 0.0774263 0.0572735 -0.0887386 0.0000113 0.1062426 -0.0044696 0.0000018 0.0000135 -0.0000062 -0.1278528 -0.0125558 0.103742 0.0000041 -0.1157635 0.0092379 -0.0000068 0.000011 0.000004 -0.1221517 -0.1420376 0.01778 0.000011 -0.1194207 0.0268152 -0.0000104 -0.0000152 -0.0000064 -0.1266522 0.3831365 0.1044264 0.0000185 0.0530544 0.3540822 0.0000079 -0.0000004 -0.0000104 -0.0644836 -0.1458637 0.13869 -0.0000014 0.2403189 0.0854063 0.0000068 -0.0000114 0.0000029 -0.1501748 -0.0680357 -0.1596099 0.000006 -0.2195034 0.0571341 -0.000013 0.0000022 -0.0000114 -0.1484168 0.1198566 -0.1186734 -0.000007 -0.1446751 0.2128042 -0.0000118 0.0000424 -0.0000016 -0.1056825 0.0516083 0.0048233 0.0000106 -0.0247087 0.0056515 -0.0000029 0.0000093 -0.0000022 -0.1432918 0.0865579 0.0757318 -0.0000052 0.0756661 0.0084869 0.0000053 -0.0000007 0.0000064 0.1585159 0.1005085 -0.0724991 -0.0000018 -0.0563241 0.0125602 0.0000006 0.0000007 -0.0000017 0.1573138 0.0976449 -0.0211128 0. 0.0278676 -0.0448303 0.0000023 -0.000002 0.0000036 0.1837288 0.0978794 0.0126825 0.0000001 0.0076468 -0.0544889 -0.0000025 -0.0000023 0.0000114 0.143864 0.0183968 -0.0745356 -0.0000056 -0.1097045 -0.0679779 -0.0000012 -0.0000058 -0.0000002 0.1589635 0.0023212 0.0830812 -0.0000089 0.1137018 -0.0504863 0.0000082 -0.0000103 0.0000075 0.1590253 -0.0517131 0.1061634 -0.000003 0.0863201 0.023636 0.0000005 -0.0000194 0.0000076 0.1482754 -0.1305617 -0.0087596 -0.0000136 -0.0102448 0.094307 0.0000006 -0.0000114 0.0000007 0.1603379 unknown
polarizability: 273.4746929|-0.0713309|140.6317325|0.0073065|0.0001074|55.2823804 unknown
InChI: InChI=1S/C12H8N2O/c1-2-4-9(5-3-1)12-14-10-8-13-7-6-11(10)15-12/h1-8H
charge 0 multiplicity 1
23 atoms
O  -0.468965 1.129471 -0.000226
N  -0.508936 -1.199669 -0.000203
N  -4.249332 -0.64122 -0.000216
C  0.271584 -0.125201 -0.000111
C  -1.811215 0.718733 -0.000184
C  1.726254 -0.036226 -0.000046
C  -1.836609 -0.705878 -0.000206
C  2.386129 1.222988 -0.000038
C  2.489773 -1.236863 0.000004
C  -2.980385 1.486448 -0.000189
C  -3.088844 -1.358442 -0.000237
C  3.794535 1.275771 0.000029
C  3.89624 -1.173436 0.000071
C  -4.180952 0.731305 -0.000177
C  4.553372 0.081296 0.000085
H  1.792898 2.142428 -0.000083
H  1.963925 -2.19692 -0.000009
H  -2.984949 2.578781 -0.000207
H  -3.17124 -2.449355 -0.000232
H  4.301744 2.246515 0.000038
H  4.481854 -2.0989 0.000113
H  -5.146817 1.24748 -0.000212
H  5.647935 0.127391 0.000136
