program: Gaussian 09
title: 000254147
version: EM64L-G09RevD.01
frameworkgroup: C1[X(C16H13NO5)]
method: RPBEPBE
basis: SDD
operation: Freq
keyword: #p
keyword: freq=noraman
keyword: PBEPBE/SDD
title: #p freq=noraman PBEPBE/SDD
converged: YES YES NO NO
title: Mulliken charges:
elementType: O O O O O N C C C C C C C C C C C C C C C C H H H H H H H H H H H H H
charge: -0.230612 -0.282223 -0.431373 -0.234667 -0.313292 -0.464230 0.178066 0.360415 0.124458 0.109653 0.047150 -0.359681 -0.327063 -0.345354 -0.298422 -0.221645 -0.221024 -0.218170 -0.244552 0.154204 0.154048 -0.500964 0.390318 0.256155 0.315873 0.272043 0.275829 0.236827 0.236704 0.234106 0.235326 0.241390 0.249284 0.232562 0.388861
chargesum: 0.00000
title: Mulliken charges with hydrogens summed into heavy atoms:
elementType: O O O O O N C C C C C C C C C C C C C C C C
charge: -0.230612 -0.282223 -0.042512 -0.234667 -0.313292 -0.073912 0.178066 0.360415 0.124458 0.109653 0.047150 -0.103527 -0.011190 -0.073310 -0.022592 0.015182 0.015680 0.015936 -0.009225 0.154204 0.154048 0.222271
polarizability: 2.80566436e+02 -2.24782200e+01 2.18389638e+02 3.34243235e+00 1.13732799e+01 1.26811093e+02
1716.lowfreq: -6.7408 -0.0011 -0.0004 -0.0003 2.3541 5.7729 10.9319 29.3010 43.3964
frequency: 10.5836 29.2861 43.3952 60.8304 74.9488 96.3167 107.3864 111.1337 136.0338 144.5951 159.3470 185.6359 201.3379 221.5217 254.4441 278.7807 308.1587 314.8388 340.4350 388.7247 398.8543 415.6495 422.0462 488.4757 511.3640 528.9103 539.2310 580.5990 586.9818 606.4031 643.2979 674.2015 682.1580 687.2248 708.3038 735.8757 764.2009 772.4823 775.9177 788.7955 790.2895 838.1397 869.2675 891.0505 905.6052 909.2113 921.9510 971.9549 982.8807 1001.9727 1010.7521 1013.9205 1038.2401 1041.6344 1044.3545 1086.1776 1114.5906 1116.5609 1135.1077 1149.3288 1164.3227 1178.2180 1178.6743 1238.4091 1248.0884 1257.9045 1275.4933 1308.4137 1329.0895 1377.8817 1387.9898 1421.1417 1427.7491 1438.3873 1451.6189 1461.2299 1464.2288 1478.7630 1516.3526 1575.6202 1582.9775 1586.5417 1599.4960 1615.3747 1628.2533 1642.6687 3004.7877 3106.9073 3134.0603 3138.1209 3146.3725 3149.5913 3159.0587 3162.7945 3179.2382 3182.0286 3194.3347 3263.1186 3531.6989
redmass: 6.1670 6.0972 6.1353 6.6010 6.5718 1.8825 2.1697 2.9401 4.0556 8.4484 5.1226 6.1282 6.1084 5.0306 6.7184 5.6094 6.1780 6.3577 6.5906 5.4117 8.0986 4.6346 3.1652 5.6613 6.4976 3.8749 4.2823 1.2037 4.9283 5.2607 6.2928 6.0259 5.5761 4.3292 4.9037 5.3098 2.5384 5.4613 2.1637 2.3113 1.7995 5.0852 6.7020 1.3119 1.3867 1.2869 7.5076 1.4031 1.3655 1.3485 1.3247 5.3931 2.7592 2.8916 3.8252 3.2787 1.2940 1.7786 1.6943 1.4774 1.6557 1.0637 1.1110 4.6270 1.8756 2.4622 1.4865 1.9796 2.9142 10.3740 9.2063 1.3221 1.8038 2.5497 1.0496 2.5875 1.0515 2.7323 2.7697 6.7831 7.0517 7.0759 6.1474 5.4377 9.7372 2.8806 1.0295 1.1044 1.0861 1.0876 1.0910 1.1049 1.0926 1.0964 1.0976 1.0966 1.0956 1.0815 1.0641
irintensity: 0.9199 1.8029 2.1632 0.4312 0.5354 2.3147 0.6176 0.4815 1.6594 1.2788 2.1621 1.7130 2.0637 6.0458 1.1508 12.6388 12.8624 8.7445 5.6417 3.7150 6.9072 4.5413 13.3341 7.8357 11.2127 3.5204 6.3884 108.7731 24.9697 47.8924 4.4313 3.8263 23.4385 59.7903 15.0123 0.7028 38.9416 22.5210 30.8944 35.5789 26.5930 2.4817 28.6137 32.0627 1.3135 43.0721 10.6145 5.6058 3.5147 0.6446 3.7034 252.6109 5.9313 29.4272 223.0408 39.5331 8.9779 136.7557 14.2741 53.3315 132.4024 0.2094 0.6506 250.2663 21.2170 113.7712 7.2573 99.0644 338.5578 8.2618 39.3089 23.5128 5.0315 44.2464 14.7654 15.5459 13.7835 13.5034 595.5712 260.3846 38.8426 189.1741 2.7679 99.7854 212.6299 39.4099 36.9319 23.2184 0.9176 7.3382 11.6824 18.6513 15.4492 17.0300 11.8840 6.5400 14.2879 184.8008 64.4164
temp: 298.150 k
press: 1.00000 atm
elementType: 8 8 8 8 8 7 6 6 6 6 6 6 6 6 6 6 6 6 6 6 6 6 1 1 1 1 1 1 1 1 1 1 1 1 1
symmnumber: 1
zpe: 680667.4 jmol-1
zpe.correction: 0.259253 hartree
zpe.thermalcorrener: 0.278876 hartree
zpe.thermalcorrenthalpy: 0.279820 hartree
zpe.thermalcorrgfe: 0.208620 hartree
zpe.sumelectzpe: -1046.859378 hartree
zpe.sumelectthermal: -1046.839754 hartree
zpe.sumelectthermalent: -1046.838810 hartree
zpe.sumelectthermalfe: -1046.910011 hartree
dipole: 0.1103 2.0085 1.2281
dipole: 2.3568
quadrupole: -98.4961 -110.1447 -127.5408
quadrupole: -0.1920 -4.1254 -2.2247
quadrupole: 13.5645 1.9158 -15.4803 -0.1920 -4.1254 -2.2247
hfenergy: -1047.1186305 hartree
pointgroup: C01 [X(C16H13N1O5)]
dipole: -0.0487697 0.5118454 0.7716409 debye
polarizability: 285.2762661|-3.2932195|188.4368784|-15.793543|40.3249686|152.0540223 unknown
InChI: InChI=1S/C16H13NO5/c1-22-16(21)11-7-3-2-6-10(11)14(18)17-13-9-5-4-8-12(13)15(19)20/h2-9,17,19H,1H3
charge 0 multiplicity 1
35 atoms
O  -0.411117 -0.565189 -1.888668
O  -3.714997 -2.451014 0.173645
O  3.998172 1.763954 2.370221
O  -1.398368 -2.325471 0.383409
O  1.71255 1.694538 2.058892
N  0.784096 0.420077 -0.102068
C  -1.644833 0.590779 -0.145763
C  2.122566 0.138963 -0.442481
C  -2.719356 -0.272539 0.215491
C  -0.376943 0.063642 -0.791272
C  3.178257 0.610139 0.421747
C  -1.820353 1.991395 -0.04562
C  2.469873 -0.597675 -1.610774
C  -3.953452 0.280061 0.638092
C  4.533862 0.331306 0.091302
C  -3.049187 2.535937 0.391279
C  -4.121544 1.678629 0.723539
C  3.819899 -0.855252 -1.908889
C  4.86147 -0.39454 -1.064427
C  -2.50599 -1.75219 0.255121
C  2.870709 1.376084 1.642077
C  -3.593804 -3.926729 0.234826
H  0.675296 0.924335 0.798554
H  -1.00077 2.658983 -0.333207
H  1.66788 -0.957348 -2.257093
H  -4.76649 -0.39891 0.908882
H  5.314436 0.698366 0.762749
H  -3.168509 3.62243 0.461244
H  -5.078691 2.09526 1.054334
H  4.062326 -1.426079 -2.812278
H  5.907905 -0.602682 -1.307888
H  -3.13445 -4.234558 1.18946
H  -2.970219 -4.289517 -0.599149
H  -4.625155 -4.296494 0.15056
H  3.695529 2.266308 3.173555
