program: Gaussian 09
title: 000250235
version: EM64L-G09RevD.01
frameworkgroup: C1[X(C22H17F3N6)]
method: RPBEPBE
basis: SDD
operation: Freq
keyword: #p
keyword: freq=noraman
keyword: PBEPBE/SDD
title: #p freq=noraman PBEPBE/SDD
converged: YES YES NO NO
title: Mulliken charges:
elementType: F F F N N N N N N C C C C C C C C C C C C C C C C C C C C C C H H H H H H H H H H H H H H H H H
charge: -0.199361 -0.202944 -0.202775 -0.402718 -0.395549 -0.024980 0.041712 -0.137818 -0.088752 0.466850 0.460896 0.443410 -0.336111 -0.336013 -0.349093 -0.356032 -0.341576 -0.337094 -0.355978 -0.358674 -0.363918 -0.365883 0.323164 0.322655 -0.386598 -0.386287 -0.365724 -0.357833 0.321785 -0.373231 0.276386 0.252044 0.286670 0.231943 0.229073 0.236343 0.248140 0.257785 0.257432 0.260203 0.256779 0.218266 0.206855 0.257910 0.254340 0.243217 0.343557 0.327527
chargesum: 0.00000
title: Mulliken charges with hydrogens summed into heavy atoms:
elementType: F F F N N N N N N C C C C C C C C C C C C C C C C C C C C C C
charge: -0.199361 -0.202944 -0.202775 -0.059161 -0.068022 -0.024980 0.041712 -0.137818 -0.088752 0.466850 0.460896 0.443410 -0.084067 -0.049343 -0.117151 -0.126959 -0.105234 -0.088953 -0.098193 -0.101242 -0.103715 -0.109104 0.323164 0.322655 -0.168332 -0.179432 -0.107814 -0.103493 0.321785 -0.130015 0.276386
polarizability: 6.10179891e+02 -4.21744172e+01 5.50395624e+02 -7.42750611e-03 2.12410424e-02 1.05940880e+02
1716.lowfreq: -2.8586 -1.7965 -0.0009 -0.0006 0.0006 2.9583 16.9210 18.1814 20.8717
frequency: 16.9111 18.0826 20.8625 22.3600 26.7237 34.6152 49.5823 53.4544 61.5086 91.7419 115.5047 117.6861 135.4562 146.5965 176.9252 206.8497 212.8910 219.9416 256.7033 271.2691 277.3497 286.3447 286.9839 308.6080 360.6934 365.3822 380.1043 384.2627 386.7357 398.4570 415.4938 417.0947 418.4412 424.0727 427.7083 472.5189 519.4015 521.2798 522.5158 547.6025 548.6870 568.0829 625.1932 625.7702 629.4783 635.0397 677.8346 698.9157 704.1434 722.5310 722.8281 724.5301 744.8740 753.3237 775.4560 780.0115 815.9543 816.4634 816.5061 832.6224 836.8454 836.8807 844.6297 863.8902 867.7786 919.2002 923.5755 929.7119 939.2512 952.0190 952.9952 964.7595 965.9920 970.5893 983.6898 1000.9056 1001.4266 1002.5160 1051.9127 1097.8434 1102.0748 1104.3278 1120.0115 1139.3337 1153.1429 1154.7011 1155.3103 1193.4167 1195.1649 1198.0857 1234.8756 1240.5970 1243.5777 1270.7889 1287.2670 1293.0356 1294.9326 1307.0944 1341.3977 1361.0700 1376.4345 1379.3955 1389.7733 1410.8467 1413.0667 1413.4545 1433.6759 1492.2493 1493.5259 1496.3485 1542.8992 1557.1805 1570.2207 1571.3297 1588.0354 1595.8853 1598.9147 1604.5309 1609.9414 1611.2544 1612.1963 2971.2808 3007.0922 3044.8813 3130.5965 3134.6714 3137.3784 3155.0379 3158.4247 3159.1040 3175.5850 3176.2168 3177.7704 3178.4961 3179.7748 3180.7480 3347.0379 3360.7188
redmass: 10.2678 8.9789 8.9532 3.8055 3.7534 4.0131 7.6499 7.0460 7.8465 9.0903 7.0591 7.1246 9.6943 7.7014 7.7186 3.6451 3.8018 4.6450 5.9789 7.9360 8.8763 4.3520 9.2105 5.5265 7.8026 7.5695 6.2656 5.2794 4.9921 4.8745 3.0892 3.1285 3.3359 5.4236 5.6333 7.1957 2.5514 2.5764 2.5992 7.2122 7.2894 7.0567 7.2174 7.2277 7.2226 4.8357 7.3976 7.1575 1.2476 3.6371 3.5014 3.4847 1.1942 5.8676 5.9796 6.1416 1.2636 1.2549 1.2900 5.9967 1.5252 1.5409 1.4704 4.3620 4.2976 1.4579 1.4444 5.2912 1.3502 1.4459 1.4337 1.3535 1.3557 1.5173 1.3466 2.7397 2.7262 2.7619 7.7964 1.7694 1.3578 1.3455 2.2983 3.1533 1.3670 1.4209 1.4169 2.0820 2.0189 2.0512 2.4031 2.3323 2.1665 1.8111 1.4438 1.3415 1.3314 1.4189 2.1250 2.8386 5.0001 3.9121 3.3009 4.2654 4.1188 3.9343 2.3285 2.6697 2.7905 2.9452 4.1802 2.6687 5.8201 7.3891 6.8565 6.7592 6.5430 6.5086 6.3974 6.4376 6.3534 1.0871 1.0877 1.0882 1.0899 1.0900 1.0899 1.0880 1.0881 1.0889 1.0960 1.0955 1.0958 1.0970 1.0974 1.0972 1.0752 1.0746
irintensity: 0.2156 0.2283 0.1474 0.0251 0.3136 0.4489 0.3133 0.0503 0.3113 2.9735 5.7178 2.4906 1.8755 0.2104 0.2282 7.3619 0.0306 0.6575 12.1732 2.6401 0.8071 20.5855 4.1256 0.1701 43.9164 43.4922 0.3639 0.0019 0.0236 0.4573 0.0637 0.1399 0.0781 20.6752 39.8934 0.0536 24.6379 50.9705 0.0010 22.6993 35.6654 3.0409 0.2672 1.0238 0.0373 2.9026 0.8361 13.6225 74.4954 0.7997 1.3541 8.7206 92.7565 0.5727 44.6804 57.6755 5.6900 1.6139 11.5726 0.9683 19.4141 110.9357 56.2826 5.2305 0.8025 32.7311 43.2288 15.6580 10.6976 5.9186 13.7839 0.0441 0.2183 24.8567 1.7932 6.0543 6.3603 9.1153 198.0871 111.8740 12.4508 21.8101 146.5812 125.1631 66.9788 67.0121 17.4559 80.4329 49.8397 62.5631 43.4333 49.2578 45.9743 63.7097 43.6005 15.9512 7.7816 67.3430 25.9026 25.3597 20.3711 2.0551 16.4958 0.6978 0.2013 7.1469 246.3432 136.7270 309.6879 151.9495 512.3841 642.1249 261.3545 83.6351 283.2328 64.6676 21.8716 396.3661 60.1623 51.0375 138.9370 49.3956 39.4345 20.3657 10.9836 9.4538 8.7804 4.8239 4.3815 1.0721 6.2825 5.2727 4.7846 9.9391 7.9454 6.0940 120.9629 58.1458
temp: 298.150 k
press: 1.00000 atm
elementType: 9 9 9 7 7 7 7 7 7 6 6 6 6 6 6 6 6 6 6 6 6 6 6 6 6 6 6 6 6 6 6 1 1 1 1 1 1 1 1 1 1 1 1 1 1 1 1 1
symmnumber: 1
zpe: 917102.4 jmol-1
zpe.correction: 0.349306 hartree
zpe.thermalcorrener: 0.376445 hartree
zpe.thermalcorrenthalpy: 0.377389 hartree
zpe.thermalcorrgfe: 0.286361 hartree
zpe.sumelectzpe: -1474.327903 hartree
zpe.sumelectthermal: -1474.300763 hartree
zpe.sumelectthermalent: -1474.299819 hartree
zpe.sumelectthermalfe: -1474.390848 hartree
dipole: 0.3070 3.1632 0.0001
dipole: 3.1781
quadrupole: -190.0192 -187.0966 -186.1556
quadrupole: -2.2965 0.0000 0.0003
quadrupole: -2.2621 0.6605 1.6016 -2.2965 0.0000 0.0003
hfenergy: -1474.6772086 hartree
pointgroup: C01 [X(C22H17F3N6)]
dipole: 0.1808676 1.2371961 0.0000379 debye
polarizability: 605.9615208|-44.8673486|554.6139943|-0.0063906|0.0215757|105.9408797 unknown
InChI: InChI=1S/C22H17F3N6/c23-19-7-1-16(2-8-19)13-26-29-22(30-27-14-17-3-9-20(24)10-4-17)31-28-15-18-5-11-21(25)12-6-18/h1-15,29-30H
charge 0 multiplicity 1
48 atoms
F  -0.595418 8.563333 0.000333
F  -7.67536 -4.517548 -0.000164
F  8.105433 -3.604849 -0.000292
N  0.858976 0.864545 -0.000006
N  -1.3191 0.010558 -0.000011
N  0.319897 2.127872 0.000061
N  -2.252375 -0.99908 -0.000054
N  1.95324 -1.469991 -0.000096
N  0.5302 -1.509238 -0.000091
C  0.664783 4.54052 0.000151
C  -4.582033 -1.657465 -0.000054
C  3.950492 -2.876168 -0.000204
C  -0.723855 4.866289 0.00016
C  -4.277757 -3.051087 -0.000102
C  1.61681 5.599596 0.000203
C  -5.944386 -1.247855 -0.000044
C  4.455451 -4.208379 -0.000319
C  4.879258 -1.793157 -0.000116
C  -1.149673 6.206546 0.000221
C  -5.306813 -4.009265 -0.000139
C  1.206988 6.94834 0.000264
C  -6.987839 -2.197193 -0.000081
C  -0.171484 7.220822 0.000272
C  -6.642169 -3.558954 -0.000128
C  1.146589 3.15755 0.000088
C  -3.522307 -0.643693 -0.000015
C  5.841898 -4.464496 -0.00035
C  6.265713 -2.030012 -0.000145
C  6.716721 -3.364884 -0.000262
C  2.500241 -2.67048 -0.000178
C  0.038188 -0.264473 -0.000039
H  -1.458231 4.055634 0.000116
H  -3.226958 -3.356075 -0.00011
H  2.687867 5.365329 0.000196
H  -6.191094 -0.179324 -0.000008
H  3.752626 -5.049625 -0.000386
H  4.49387 -0.769253 -0.000025
H  -2.210333 6.473981 0.000227
H  -5.093616 -5.082127 -0.000175
H  1.928496 7.770011 0.000305
H  -8.039796 -1.898276 -0.000075
H  2.243161 3.010507 0.000059
H  -3.842285 0.418544 0.000053
H  6.2404 -5.4829 -0.000439
H  6.991377 -1.211335 -0.000078
H  1.849371 -3.561692 -0.000231
H  1.868266 0.634923 -0.000042
H  -1.564633 1.014775 0.000047
