program: Gaussian 09
title: 000250233
version: EM64L-G09RevD.01
frameworkgroup: C1[X(C10H22N8)]
method: RPBEPBE
basis: SDD
operation: Freq
keyword: #pfreq=noraman
keyword: PBEPBE/SDD
title: #p freq=noraman PBEPBE/SDD
converged: YES YES NO NO
title: Mulliken charges:
elementType: N N N N N N N N C C C C C C C C C C H H H H H H H H H H H H H H H H H H H H H H
charge: -0.154708 -0.119418 -0.164278 -0.148324 -0.625776 -0.625324 -0.621213 -0.622173 -0.353292 -0.356429 -0.404432 -0.355597 -0.457112 -0.697299 0.133185 -0.391319 0.259565 0.246894 0.182130 0.187501 0.188812 0.188443 0.206776 0.226840 0.192919 0.194051 0.221484 0.208485 0.212379 0.209589 0.209287 0.236828 0.300856 0.359989 0.331768 0.306996 0.300199 0.355943 0.305112 0.330665
chargesum: 0.00000
title: Mulliken charges with hydrogens summed into heavy atoms:
elementType: N N N N N N N N C C C C C C C C C C
charge: -0.154708 -0.119418 -0.164278 -0.148324 0.035069 0.013440 0.034929 0.013604 0.016339 0.020826 0.029183 0.031372 -0.027143 -0.066044 0.133185 -0.154492 0.259565 0.246894
polarizability: 3.06990549e+02 -1.01987820e+02 2.62996006e+02 -8.22151267e+00 -1.55705333e+01 1.10589556e+02
1716.lowfreq: -11.9664 -3.4471 -2.1896 -0.0007 -0.0005 0.0003 16.4921 35.8216 40.0727
frequency: 16.2736 35.7705 40.0498 53.5221 55.8796 59.9751 70.6832 87.5527 121.0750 125.7999 134.6881 140.9743 174.2852 184.4564 220.5498 232.3764 242.1217 243.3022 257.4276 276.5715 312.5348 329.3554 384.7710 394.2735 405.3964 410.6320 425.2716 440.9454 463.6388 471.6481 514.8831 526.2434 578.5164 616.2040 636.6400 643.5301 664.1212 684.4756 723.3121 726.0011 734.0263 742.1686 794.6589 870.3351 883.6179 895.7401 929.5568 933.4651 949.1478 980.1157 1000.8997 1010.0454 1014.4553 1019.4787 1047.1265 1053.0251 1064.6004 1077.0536 1096.9185 1113.9104 1128.6523 1134.3412 1194.2817 1225.8487 1241.3088 1266.5626 1281.4103 1284.3975 1289.9516 1296.6233 1321.6344 1341.0150 1349.5287 1371.4503 1389.3184 1441.1545 1462.2669 1464.0529 1473.2931 1478.4305 1481.7986 1488.7680 1489.2069 1492.8190 1495.2868 1505.5081 1551.5569 1571.9712 1580.3735 1592.4656 1619.3859 1629.8638 2947.2265 2953.2577 2964.8375 2970.1276 2976.8183 2985.1216 2999.4689 3001.7564 3025.6129 3041.3265 3061.1122 3066.8299 3068.3339 3071.4052 3457.8639 3470.9798 3546.4691 3551.8506 3667.6257 3671.1733 3696.6773 3703.8916
redmass: 4.5820 4.7018 3.9525 3.5927 3.5140 1.9498 2.9802 4.0302 1.7297 5.5907 2.9786 2.7144 3.1265 1.5017 3.1135 1.5695 2.3399 1.1097 3.1478 2.8985 3.3288 2.8234 3.0840 1.3426 1.8341 1.7132 3.8525 3.1479 2.8442 2.7153 1.1876 1.2100 4.2782 3.5309 2.5890 2.9609 4.1781 3.4895 1.2918 1.2555 1.4798 1.1715 1.2882 2.3345 1.5743 2.2089 4.1680 5.0063 1.4705 1.2580 2.2171 3.2704 2.1505 2.8774 1.7555 1.8409 2.7689 2.2460 1.5321 2.4105 3.0200 2.7579 1.6452 1.2786 1.3996 1.2999 1.1695 1.1605 1.1958 1.1369 1.4012 1.4981 1.6642 3.8394 1.2174 1.1143 1.0673 1.0750 1.0775 1.0426 1.0817 1.1954 1.7964 2.2368 4.5351 3.7413 3.6965 2.3534 1.7468 1.9734 1.4044 1.7032 1.0587 1.0587 1.0590 1.0364 1.0626 1.0947 1.0630 1.0945 1.1029 1.1025 1.0885 1.1007 1.0993 1.1042 1.0504 1.0491 1.0449 1.0449 1.0981 1.0971 1.1037 1.1041
irintensity: 0.1121 8.2996 1.0214 2.9585 0.7957 1.2452 0.2390 6.7003 0.1305 11.2738 0.2670 0.5843 26.6307 151.6674 20.0707 65.2120 122.7419 1.7775 13.8272 1.9453 15.4991 51.1598 47.8117 122.4876 279.4342 163.0971 22.3080 8.6944 4.0395 8.1844 113.0392 177.8102 32.2785 12.9449 21.5985 27.9566 8.4430 4.7051 58.0328 77.4521 156.4384 0.9723 9.6290 10.2996 4.2230 6.2045 95.6253 67.9717 26.8405 0.7175 5.1617 0.1796 0.7188 0.4732 11.6278 0.7548 1.1830 0.5397 28.9875 22.6578 13.4960 184.0003 3.7212 7.5652 7.4056 5.8767 1.7369 4.1536 3.4202 0.9347 2.1960 2.1564 0.8364 14.8678 11.0898 21.7420 1.8535 0.6522 0.3233 11.2187 5.4010 9.5934 85.1674 39.6929 835.2044 338.2345 507.6642 178.1205 907.5960 9.6271 1066.5864 48.0252 7.8406 12.4352 80.8346 38.0746 31.6069 3.6956 36.8834 10.3773 27.5786 33.3866 22.2025 69.6581 57.8241 42.1828 33.6761 37.1807 93.8999 84.9127 73.9347 73.3355 28.1954 32.4743
temp: 298.150 k
press: 1.00000 atm
elementType: 7 7 7 7 7 7 7 7 6 6 6 6 6 6 6 6 6 6 1 1 1 1 1 1 1 1 1 1 1 1 1 1 1 1 1 1 1 1 1 1
symmnumber: 1
zpe: 886255.6 jmol-1
zpe.correction: 0.337557 hartree
zpe.thermalcorrener: 0.359665 hartree
zpe.thermalcorrenthalpy: 0.360610 hartree
zpe.thermalcorrgfe: 0.284155 hartree
zpe.sumelectzpe: -830.817973 hartree
zpe.sumelectthermal: -830.795865 hartree
zpe.sumelectthermalent: -830.794921 hartree
zpe.sumelectthermalfe: -830.871376 hartree
dipole: 0.0047 0.5032 -0.3723
dipole: 0.6260
quadrupole: -74.0009 -74.6435 -113.3244
quadrupole: -31.9776 -2.0045 -8.0126
quadrupole: 13.3220 12.6795 -26.0015 -31.9776 -2.0045 -8.0126
hfenergy: -831.1555304 hartree
pointgroup: C01 [X(C10H22N8)]
dipole: -0.0772289 0.1522502 0.1775108 debye
polarizability: 217.7285792|84.287124|342.634831|-7.7625281|41.7051508|120.2127 unknown
InChI: InChI=1S/C10H22N8/c1-2-3-4-5-6-8(16-18-10(13)14)7-15-17-9(11)12/h7H,2-6,11-14H2,1H3
charge 0 multiplicity 1
40 atoms
N  -0.80425 2.24087 0.552206
N  -2.167117 -1.018052 -0.032893
N  0.346091 3.002343 0.241716
N  -3.380135 -1.61364 0.395923
N  -0.781535 4.611615 1.622546
N  1.266388 5.131102 0.526567
N  -2.451991 -3.523969 -0.73451
N  -4.63895 -3.573118 0.199856
C  2.619745 -0.704467 -0.762699
C  3.810087 -1.206851 0.085046
C  1.479393 -0.103726 0.088302
C  4.958972 -1.804112 -0.759333
C  0.298027 0.407332 -0.781313
C  6.145165 -2.297917 0.097337
C  -0.820717 1.001454 0.053129
C  -2.007233 0.227793 0.386804
C  0.254589 4.226667 0.800714
C  -3.463919 -2.880756 -0.050814
H  2.223799 -1.543799 -1.373284
H  2.979201 0.061351 -1.48215
H  4.203381 -0.367017 0.69549
H  3.451036 -1.971284 0.80599
H  1.107275 -0.866528 0.801415
H  1.867454 0.74291 0.686356
H  4.565501 -2.644674 -1.36727
H  5.315092 -1.040271 -1.480933
H  0.681274 1.1891 -1.463888
H  -0.107507 -0.428475 -1.379021
H  6.953569 -2.718143 -0.529555
H  5.821714 -3.085026 0.804772
H  6.574306 -1.469935 0.693024
H  -2.770492 0.722381 1.009596
H  -0.960893 5.575981 1.883933
H  -1.494209 3.882138 1.732284
H  2.009403 4.800256 -0.085083
H  1.41993 5.954839 1.100938
H  -2.608547 -4.363856 -1.283787
H  -1.640696 -2.922202 -0.907096
H  -4.660917 -4.589363 0.207863
H  -5.357788 -3.05795 0.704125
