program: Gaussian 09
title: 000254148
version: EM64L-G09RevD.01
frameworkgroup: C1[X(C16H14O5)]
method: RPBEPBE
basis: SDD
operation: Freq
keyword: #pfreq=noraman
keyword: PBEPBE/SDD
title: #p freq=noraman PBEPBE/SDD
converged: YES YES NO NO
title: Mulliken charges:
elementType: O O O O O C C C C C C C C C C C C C C C C H H H H H H H H H H H H H H
charge: -0.263123 -0.257478 -0.227793 -0.431961 -0.240649 0.213358 0.250733 0.022333 0.225269 0.123601 -0.329711 -0.515005 0.354085 -0.358133 -0.401720 -0.336587 -0.227787 -0.224275 0.078613 -0.555547 -0.536303 0.243949 0.278161 0.273340 0.244322 0.277507 0.239015 0.238092 0.269083 0.271394 0.222250 0.248103 0.223863 0.222774 0.386228
chargesum: 0.00000
title: Mulliken charges with hydrogens summed into heavy atoms:
elementType: O O O O O C C C C C C C C C C C C C C C C
charge: -0.263123 -0.257478 -0.227793 -0.045733 -0.240649 0.213358 0.250733 0.022333 0.225269 0.123601 -0.085763 -0.236844 0.354085 -0.084793 -0.157398 -0.059080 0.011228 0.013817 0.078613 0.207180 0.158437
polarizability: 2.51606373e+02 7.66294855e+00 1.95301158e+02 2.15538762e+01 -1.12429216e+00 1.55261144e+02
1716.lowfreq: -8.2491 -4.6307 -0.0008 -0.0002 0.0005 3.8818 21.2032 48.0673 57.6884
frequency: 21.1556 48.0533 57.6855 64.6832 88.9595 106.6969 120.0324 126.2939 143.5838 179.7256 194.1401 210.1263 216.1545 235.3103 241.5536 257.6044 271.9358 316.0875 340.7935 356.8558 384.3269 404.4512 406.8063 459.4276 506.8997 523.4537 539.6076 573.4433 594.8694 599.9778 618.2795 632.6456 664.5087 680.7995 695.5393 705.1261 744.8383 767.4984 788.0957 791.7586 803.5228 844.3814 878.4139 897.4630 913.1443 941.0731 975.8568 976.6839 1002.2255 1005.2834 1012.6816 1041.5143 1096.9486 1111.8420 1116.5895 1121.4357 1146.2971 1157.1556 1161.9885 1165.5387 1178.1907 1188.0992 1244.6662 1257.8386 1275.0824 1287.4589 1316.9241 1377.9243 1379.6981 1412.1940 1425.8093 1434.0131 1447.1609 1462.2127 1467.5645 1470.7824 1472.5861 1480.4166 1486.8188 1527.7188 1557.1888 1573.2564 1600.3824 1622.4705 1637.7298 2964.7113 2999.3127 3055.0089 3115.2607 3121.8433 3128.5938 3137.6473 3141.0206 3153.0944 3166.1937 3173.5694 3179.8997 3184.1311 3526.2605
redmass: 6.2841 5.8588 4.9228 6.6205 4.4011 4.7793 4.5776 4.3579 4.9799 4.5209 2.2869 1.9343 2.1987 1.9953 3.1830 3.6191 4.0040 4.2045 7.4043 4.3036 6.9947 4.6708 4.0245 3.2370 5.0414 5.0511 5.7447 5.1699 1.7788 2.2991 5.0405 4.2525 4.6542 4.5038 5.4719 3.7904 3.3276 3.0640 1.8968 2.5110 2.2692 5.9670 1.6391 1.9164 3.2014 1.3618 7.8738 1.4509 4.1760 1.4477 2.9106 2.4283 2.5266 1.2609 1.4078 1.5722 1.4703 2.0059 1.7918 1.3892 1.0702 1.8036 2.6731 2.3252 1.6939 2.1553 2.6160 6.2253 4.8202 4.1078 2.1585 1.2163 1.3453 1.1437 1.0508 2.4642 1.0864 1.3067 1.9269 5.7103 8.3396 6.9053 6.1794 6.8209 8.6692 1.0328 1.0279 1.1042 1.1052 1.1056 1.0997 1.0863 1.0879 1.0909 1.0963 1.0945 1.0979 1.0921 1.0642
irintensity: 0.2479 0.9388 2.6295 1.0963 3.6024 5.5953 0.2578 5.0856 3.5723 0.9510 1.6795 2.6622 0.9509 2.6332 3.4501 4.7062 5.8054 2.7603 1.8861 1.8335 11.7706 1.6223 5.8407 8.1867 28.1474 6.2444 8.4086 41.6366 65.8589 54.2327 17.1905 11.1089 4.0926 7.4367 13.0875 66.9736 48.6222 7.9888 37.4821 14.8297 14.8796 8.7397 41.5921 7.9053 28.3517 0.0459 5.6741 10.8178 196.6767 18.2698 60.2062 5.1175 77.9864 1.2529 48.0896 113.7656 14.4180 17.7934 84.3856 68.2541 0.5212 86.1597 135.4735 164.2112 85.6147 64.1312 73.8101 9.2772 53.9021 6.5883 6.5209 3.6647 23.8231 26.5362 13.9077 9.2893 49.5546 15.6797 96.5010 247.4153 100.0183 24.3419 12.2318 336.6078 256.6463 69.0644 54.1597 43.9898 6.1548 21.6005 26.0133 2.6149 4.7234 9.1832 11.9388 9.1531 12.5597 0.4539 46.1521
temp: 298.150 k
press: 1.00000 atm
elementType: 8 8 8 8 8 6 6 6 6 6 6 6 6 6 6 6 6 6 6 6 6 1 1 1 1 1 1 1 1 1 1 1 1 1 1
symmnumber: 1
zpe: 691923.4 jmol-1
zpe.correction: 0.263540 hartree
zpe.thermalcorrener: 0.282920 hartree
zpe.thermalcorrenthalpy: 0.283864 hartree
zpe.thermalcorrgfe: 0.215156 hartree
zpe.sumelectzpe: -992.696404 hartree
zpe.sumelectthermal: -992.677024 hartree
zpe.sumelectthermalent: -992.676079 hartree
zpe.sumelectthermalfe: -992.744788 hartree
dipole: -1.5742 -5.5624 1.4969
dipole: 5.9715
quadrupole: -108.7029 -115.0613 -113.3862
quadrupole: -4.7651 2.2432 6.1498
quadrupole: 3.6806 -2.6779 -1.0027 -4.7651 2.2432 6.1498
hfenergy: -992.9599439 hartree
pointgroup: C01 [X(C16H14O5)]
dipole: 0.8879443 2.1564022 -0.2846585 debye
polarizability: 248.9169657|-8.6415117|191.7999232|-26.9588093|-9.6692593|161.4517869 unknown
InChI: InChI=1S/C16H14O5/c1-20-10-7-8-13(14(9-10)21-2)15(17)11-5-3-4-6-12(11)16(18)19/h3-9,18H,1-2H3
charge 0 multiplicity 1
35 atoms
O  -2.274057 -2.342104 0.806549
O  -4.539291 1.548219 -0.535313
O  0.339883 -2.679165 -0.847031
O  2.151996 1.551044 2.04881
O  0.933703 -0.417854 2.016285
C  -0.87855 -0.619815 -0.427849
C  1.669731 -0.689877 -0.879083
C  0.349532 -1.419379 -0.666456
C  -2.100186 -1.136987 0.140552
C  2.266951 0.209536 0.05578
C  -0.922473 0.699708 -0.969981
C  -3.288924 -0.376378 0.063897
C  -3.298478 0.903184 -0.524781
C  2.336271 -0.937642 -2.104193
C  -2.09541 1.466028 -1.034137
C  3.481312 0.869377 -0.271998
C  3.546273 -0.284395 -2.42224
C  4.115362 0.632439 -1.507856
C  1.699233 0.378186 1.4220
C  -1.170039 -3.009322 1.528281
C  -4.602615 2.89839 -1.103978
H  -0.00601 1.113547 -1.403541
H  -4.203964 -0.782025 0.502095
H  1.887295 -1.650313 -2.803241
H  -2.072435 2.460842 -1.486043
H  3.922815 1.550174 0.460762
H  4.040223 -0.487608 -3.378527
H  5.0526 1.144682 -1.749236
H  -0.470528 -2.265918 1.945732
H  -0.632899 -3.685402 0.844607
H  -1.671155 -3.570796 2.332375
H  -5.654713 3.201411 -1.001862
H  -4.316451 2.897224 -2.173299
H  -3.955319 3.601086 -0.544761
H  1.772214 1.585005 2.967883
