program: Gaussian 09
title: 000254105
version: EM64L-G09RevD.01
frameworkgroup: C1[X(C7H13NO3)]
method: RPBEPBE
basis: SDD
operation: Freq
keyword: #p
keyword: freq=noraman
keyword: PBEPBE/SDD
title: #p freq=noraman PBEPBE/SDD
converged: YES YES NO NO
title: Mulliken charges:
elementType: O O O N C C C C C C C H H H H H H H H H H H H H
charge: -0.273411 -0.276497 -0.223155 -0.012790 -0.050969 -0.714785 0.241797 0.201484 -0.757636 -0.737789 -0.503751 0.243165 0.229381 0.239937 0.237677 0.232123 0.227533 0.249235 0.264779 0.219174 0.246596 0.245015 0.239795 0.233093
chargesum: 0.00000
title: Mulliken charges with hydrogens summed into heavy atoms:
elementType: O O O N C C C C C C C
charge: -0.273411 -0.276497 -0.223155 -0.012790 0.192195 -0.007790 0.241797 0.201484 -0.048745 -0.007240 0.214153
polarizability: 1.25802382e+02 6.60324361e+00 9.04672132e+01 -7.98932696e+00 2.70611508e-01 7.62977061e+01
1716.lowfreq: -9.8616 -1.7269 -0.0005 -0.0001 0.0004 6.4433 20.7135 27.7869 52.0239
frequency: 20.4139 27.2881 51.9603 58.7234 82.0432 118.1428 142.0940 183.3278 198.6387 215.9976 231.1335 259.4172 292.7551 327.1936 331.8841 423.1864 459.9572 494.6700 578.4835 642.2885 696.7267 796.8877 821.9927 851.1146 906.2067 942.9697 957.1427 970.7835 1035.2094 1058.8027 1083.8669 1090.8320 1109.2047 1113.6222 1147.2735 1153.4552 1277.9691 1286.5812 1323.6409 1382.5427 1383.2614 1392.8738 1422.1549 1451.6830 1452.1828 1453.1512 1461.6920 1463.4513 1465.1695 1467.5937 1477.3461 1613.6384 1662.9033 2975.2776 2988.8757 3001.4111 3003.9588 3033.0445 3053.6629 3070.5672 3105.3915 3107.3566 3107.5066 3108.8973 3111.2263 3148.6030
redmass: 2.6601 2.1540 2.8931 1.6796 1.1586 3.1992 3.2345 1.8121 1.2544 1.5080 3.1730 2.8948 3.5026 3.9532 3.5562 3.5253 4.0011 3.8078 3.9338 5.1232 4.7975 3.6825 3.8460 5.0461 3.6243 3.6653 1.2609 1.3843 2.1760 1.7374 1.6631 2.6640 2.9639 1.3985 1.5228 2.1561 1.9606 2.1382 1.4081 1.2372 1.2097 1.2320 1.1745 1.1036 1.0504 1.0568 1.0503 1.0469 1.0504 1.0681 1.0540 6.2342 9.7723 1.0370 1.0365 1.0345 1.0295 1.0848 1.0976 1.0959 1.1045 1.1010 1.1003 1.1002 1.0995 1.1048
irintensity: 1.6706 1.2215 0.4114 3.5315 0.5029 4.9977 1.4254 2.3246 0.8857 2.4160 4.5913 2.0706 6.5572 9.2434 1.5949 0.4345 15.4998 3.5992 5.2701 14.4214 2.3628 5.2514 26.8877 89.8963 50.5869 22.0173 0.1421 5.6846 30.6802 53.2242 9.0817 165.3077 189.7593 27.6852 17.8188 5.2871 10.3887 6.8135 9.2737 51.0704 16.3154 11.3708 12.7125 21.1150 13.7076 16.4607 14.1399 14.8043 9.2456 5.0947 12.4731 8.4421 152.1200 24.2330 17.3739 16.6734 33.1042 16.1015 18.4916 10.9529 24.3797 21.0731 10.7859 22.3343 26.1420 17.0758
temp: 298.150 k
press: 1.00000 atm
elementType: 8 8 8 7 6 6 6 6 6 6 6 1 1 1 1 1 1 1 1 1 1 1 1 1
symmnumber: 1
zpe: 509186.3 jmol-1
zpe.correction: 0.193939 hartree
zpe.thermalcorrener: 0.208113 hartree
zpe.thermalcorrenthalpy: 0.209057 hartree
zpe.thermalcorrgfe: 0.150695 hartree
zpe.sumelectzpe: -554.029946 hartree
zpe.sumelectthermal: -554.015772 hartree
zpe.sumelectthermalent: -554.014827 hartree
zpe.sumelectthermalfe: -554.073190 hartree
dipole: 0.0973 0.0126 -0.6516
dipole: 0.6590
quadrupole: -48.5757 -61.2973 -70.2268
quadrupole: -0.5333 -1.1001 0.6678
quadrupole: 11.4576 -1.2640 -10.1935 -0.5333 -1.1001 0.6678
hfenergy: -554.2238849 hartree
pointgroup: C01 [X(C7H13N1O3)]
dipole: -0.0068631 0.2365624 0.1058711 debye
dipolederiv: -1.0384668 0.2200194 -0.1916498 0.2235872 -0.3223687 0.0686133 -0.8234492 0.3351392 -0.6257996 -1.1850669 0.1340671 0.483474 0.1535019 -0.5289162 -0.1070502 0.5878754 -0.0721224 -0.5929451 -0.5811456 -0.0438288 0.1480536 0.2300959 -0.8643245 -0.1148154 0.1622651 0.0386356 -0.3706607 0.0815705 -0.0729917 0.184518 0.0050733 -0.1799125 -0.0609104 0.8347108 -0.3117917 0.1034515 1.0087783 -0.1935314 0.1767095 -0.2992775 0.2870358 -0.0094307 0.016113 0.0903602 0.1500615 -0.1395591 -0.0121088 -0.0116768 0.0197159 0.0232164 0.0634507 -0.0586306 0.0149677 -0.0007761 1.1458465 -0.1050196 -0.6238167 -0.4273567 1.0463635 0.2333914 -0.6519139 0.035209 0.5424147 0.1951333 -0.1187357 -0.0054548 -0.1429644 0.0692689 0.089617 -0.0660811 0.1168751 0.4136623 -0.0919615 0.0654032 -0.1108059 0.0866343 0.0364143 0.0225314 -0.0171455 -0.0178016 -0.1022851 0.033181 0.00376 0.0181267 0.0062979 0.0574477 -0.0814875 0.0711696 -0.1224809 -0.2704213 0.5126238 0.0371012 -0.1386785 0.1546717 0.2341737 -0.072538 -0.141107 -0.0261847 0.3602007 -0.016063 0.0057543 -0.0247938 0.0341109 -0.0488927 -0.0488536 0.0569906 -0.1082508 0.00366 -0.1061848 0.0922801 -0.010953 0.0906649 0.0784484 0.0014838 0.0032443 -0.0215117 0.0881316 0.0447855 -0.1093708 0.0668739 -0.1055691 -0.0023348 0.0745993 0.0648034 0.0872773 0.0151557 0.1232037 -0.0040267 0.0061703 -0.0118796 -0.0432386 -0.1254401 -0.0213516 -0.0574185 0.0103619 0.0762636 0.0262565 -0.0297716 0.0602708 -0.1241194 0.0625088 -0.0735788 0.0269196 0.0674697 -0.1411964 -0.0642037 -0.0204592 -0.0919718 0.0804523 0.0099216 -0.0096724 0.0511403 0.063333 0.0817583 0.0484135 0.107242 0.0346362 0.0779588 -0.0916741 0.0487229 -0.060885 -0.0357355 0.0293489 -0.0970232 -0.0581474 -0.0365459 0.0481674 -0.05504 -0.0259094 -0.0476613 0.0677137 -0.0830979 0.1232787 -0.019907 0.1349395 0.0257144 0.010451 -0.0477179 0.0388774 0.0917613 0.0848866 0.0015878 0.0381955 -0.0488724 -0.0168807 0.0994947 0.0682913 0.0541161 0.0229529 -0.0066656 0.046852 -0.0666964 -0.0358503 0.036199 0.1241707 -0.0036901 0.0747116 -0.0376252 0.0017324 -0.0494011 -0.0004095 -0.1369187 0.0180747 -0.0351003 -0.060016 -0.0833586 -0.035488 -0.0297047 0.0654678 0.083857 0.1030063 0.0120527 -0.0578934 0.0860771 -0.0347617 0.071406 unknown
polarizability: 122.4738865|-15.7944781|82.0668984|1.5109564|-5.4732719|88.0265165 unknown
InChI: InChI=1S/C7H13NO3/c1-5(2)8-11-6(3)7(9)10-4/h6H,1-4H3
charge 0 multiplicity 1
24 atoms
O  0.796494 0.515955 -0.913964
O  -2.494155 0.709554 0.639219
O  -1.343307 -1.201641 -0.044243
N  1.447741 0.378604 0.415843
C  -0.537846 1.07466 -0.689428
C  -1.083171 1.461641 -2.07415
C  -1.451982 0.040179 -0.012505
C  2.573546 -0.28969 0.299831
C  3.358422 -0.478458 1.579193
C  3.101425 -0.865565 -0.995965
C  -3.499059 -0.158271 1.299942
H  -0.46834 1.956741 -0.027449
H  -2.092131 1.896612 -1.974546
H  -0.416506 2.207425 -2.538667
H  -1.134923 0.576551 -2.731039
H  3.487321 -1.556155 1.79529
H  4.370569 -0.040929 1.481913
H  2.843727 -0.002994 2.42952
H  2.3192 -1.470902 -1.488354
H  3.994361 -1.48613 -0.817478
H  3.361727 -0.057725 -1.705433
H  -3.018597 -0.759162 2.090109
H  -3.965164 -0.835327 0.564071
H  -4.236753 0.537227 1.72379
