program: Gaussian 09
title: 000254094
version: EM64L-G09RevD.01
frameworkgroup: C1[X(C15H9Cl2FN2S)]
method: RPBEPBE
basis: SDD
operation: Freq
keyword: #p
keyword: freq=noraman
keyword: PBEPBE/SDD
title: #p freq=noraman PBEPBE/SDD
converged: NO YES NO NO
title: Mulliken charges:
elementType: Cl Cl S F N N C C C C C C C C C C C C C C C H H H H H H H H H
charge: -0.048205 -0.029011 0.214222 -0.164397 -0.035048 -0.037155 0.471176 -0.818780 -0.238706 0.608850 -0.220903 -0.382216 -0.281933 -0.343574 0.297548 -0.351658 -0.203918 -0.373474 -0.200916 -0.217754 -0.099130 0.300368 0.294120 0.274327 0.251767 0.273795 0.243110 0.266643 0.285693 0.265159
chargesum: 0.00000
title: Mulliken charges with hydrogens summed into heavy atoms:
elementType: Cl Cl S F N N C C C C C C C C C C C C C C C
charge: -0.048205 -0.029011 0.214222 -0.164397 -0.035048 -0.037155 0.471176 -0.224292 -0.238706 0.608850 -0.220903 -0.107888 -0.281933 -0.091807 0.297548 -0.077863 0.039192 -0.106831 0.084777 0.047405 -0.099130
polarizability: 3.48643007e+02 -1.12080643e+01 2.30828524e+02 1.36975627e+01 6.68777271e+00 1.00022367e+02
1716.lowfreq: -3.3771 -0.0024 -0.0022 -0.0022 3.8881 6.7707 16.9915 27.0716 30.2310
frequency: 16.9345 27.0509 30.2255 54.3412 61.2693 98.6524 134.8985 164.4779 170.2873 186.7347 188.0860 199.5241 259.3828 269.8484 281.9924 314.6215 357.5336 371.6586 400.3692 433.8251 446.2039 456.5101 467.5270 487.1207 504.8559 529.7444 539.1474 585.4225 597.7631 624.7487 638.3835 662.3293 689.2944 732.6292 769.2330 781.1708 792.0747 819.8989 827.0262 836.3435 865.5305 866.3207 889.7921 905.0969 909.7677 958.6562 986.6701 1020.3309 1026.0804 1065.0815 1080.4383 1083.6651 1108.5778 1125.0732 1156.6037 1180.2697 1200.7528 1220.0040 1233.0299 1237.6812 1253.5079 1268.1767 1360.1205 1365.7508 1381.2100 1390.4581 1418.6893 1454.6177 1458.6095 1462.1850 1503.4595 1552.1401 1566.4248 1594.3040 1618.9916 3050.0031 3127.5486 3144.7401 3145.1083 3162.6114 3175.2400 3179.9354 3181.6952 3185.9139
redmass: 11.6163 11.2587 8.6112 8.7172 9.5717 9.9164 8.3939 6.2256 4.6216 9.2092 15.2311 7.1202 4.9162 4.0782 13.0569 7.4980 13.3097 9.7320 6.7653 3.5312 3.6310 4.0759 7.5757 6.1213 7.9751 6.9686 6.0363 9.1368 5.3911 5.2020 6.6317 5.0847 6.7058 4.0420 2.0017 7.5637 7.2714 2.8298 2.2977 2.0040 6.5318 1.4164 1.4857 1.3937 1.3691 1.3653 1.3174 5.6390 3.7920 2.0781 2.0489 5.2108 1.4777 6.0009 1.1612 1.2300 5.5127 2.2471 1.8282 1.3945 1.8494 1.3840 2.3657 4.0996 5.1812 3.9320 4.4079 2.9761 1.1405 2.7217 6.7212 7.1879 7.8234 7.3952 7.0608 1.0572 1.1092 1.0878 1.0901 1.0942 1.0932 1.0959 1.0972 1.0939
irintensity: 0.4282 0.9832 3.8906 0.1354 0.3767 0.2548 0.1179 0.0133 5.0838 1.6196 1.2220 0.6057 0.4626 1.0344 0.3533 0.4771 2.6651 5.1942 14.4532 2.2626 8.5415 5.9947 3.1545 5.3571 1.0445 0.2135 5.5087 1.0212 5.1070 25.4037 3.5847 1.9995 20.9013 20.5738 32.1927 23.2998 11.5208 45.6439 31.1455 57.5342 25.9805 21.1313 11.1375 7.1684 6.1397 0.0941 1.7020 1.0199 25.1738 5.9541 30.0501 9.8769 19.4667 22.7630 2.2369 2.7560 26.8196 1.6023 9.2360 46.7459 30.8495 0.2321 5.4410 5.5899 11.0125 172.1580 4.2313 20.1378 3.8944 102.8454 50.9927 11.8376 23.7300 67.5618 19.1792 9.6559 1.3125 1.5735 5.6929 4.9697 2.0360 0.9659 4.5104 1.3566
temp: 298.150 k
press: 1.00000 atm
elementType: 17 17 16 9 7 7 6 6 6 6 6 6 6 6 6 6 6 6 6 6 6 1 1 1 1 1 1 1 1 1
symmnumber: 1
zpe: 525938.2 jmol-1
zpe.correction: 0.200319 hartree
zpe.thermalcorrener: 0.218689 hartree
zpe.thermalcorrenthalpy: 0.219633 hartree
zpe.thermalcorrgfe: 0.150592 hartree
zpe.sumelectzpe: -2103.022989 hartree
zpe.sumelectthermal: -2103.004620 hartree
zpe.sumelectthermalent: -2103.003675 hartree
zpe.sumelectthermalfe: -2103.072717 hartree
dipole: 4.6178 2.5310 -0.7212
dipole: 5.3151
quadrupole: -177.0587 -133.7827 -143.8530
quadrupole: -23.8227 -5.9008 2.5202
quadrupole: -25.4939 17.7821 7.7118 -23.8227 -5.9008 2.5202
hfenergy: -2103.2233088 hartree
pointgroup: C01 [X(C15H9Cl2F1N2S1)]
dipole: 1.775748 -1.0771158 0.2436528 debye
polarizability: 348.5368694|5.7790389|230.1341683|-20.03707|6.3036197|100.8228607 unknown
InChI: InChI=1S/C15H9Cl2FN2S/c16-10-5-4-9(12(17)6-10)8-21-14-7-19-20-15-11(14)2-1-3-13(15)18/h1-7H,8H2
charge 0 multiplicity 1
30 atoms
Cl 1.997797 -2.441995 -0.300211
Cl 7.163293 -0.467223 -0.340451
S  0.365972 1.109673 -1.075246
F  -5.73688 -0.542865 0.773846
N  -4.099896 1.628424 0.24586
N  -3.31355 2.689662 -0.023615
C  -2.207609 0.067043 -0.316359
C  1.153066 0.4859 0.587067
C  -1.393925 1.227605 -0.547656
C  2.614942 0.227471 0.360902
C  -3.572564 0.343244 0.099332
C  -1.771779 -1.285639 -0.477758
C  3.128529 -1.02985 -0.044519
C  3.559432 1.275327 0.538083
C  -4.425613 -0.77994 0.365144
C  -1.98665 2.48623 -0.406466
C  -2.651425 -2.337143 -0.210954
C  -3.991425 -2.092198 0.223006
C  4.499657 -1.265321 -0.260809
C  4.940299 1.083997 0.329659
C  5.388972 -0.190736 -0.068067
H  0.603231 -0.419693 0.882686
H  0.987118 1.288376 1.321048
H  -0.755289 -1.478118 -0.836359
H  3.195175 2.262157 0.844037
H  -1.425186 3.407042 -0.583923
H  -2.320411 -3.372283 -0.34153
H  -4.679482 -2.915799 0.433316
H  4.859641 -2.249732 -0.568177
H  5.64916 1.903482 0.473311
