program: Gaussian 09
title: 000254072
version: EM64L-G09RevD.01
frameworkgroup: C1[X(C18H14O4)]
method: RPBEPBE
basis: SDD
operation: Freq
keyword: #pfreq=noraman
keyword: PBEPBE/SDD
title: #p freq=noraman PBEPBE/SDD
converged: YES YES NO NO
title: Mulliken charges:
elementType: O O O O C C C C C C C C C C C C C C C C C C H H H H H H H H H H H H H H
charge: -0.283416 -0.284278 -0.397024 -0.396950 0.233896 0.233666 0.132780 0.133789 -0.469301 -0.469000 0.347574 0.347820 -0.350147 -0.380936 -0.349295 -0.380618 -0.211434 -0.193352 -0.211906 -0.193340 -0.254791 -0.254881 0.264406 0.264032 0.260022 0.258133 0.259488 0.257959 0.226121 0.229268 0.225958 0.229162 0.229132 0.228991 0.359231 0.359242
chargesum: 0.00000
title: Mulliken charges with hydrogens summed into heavy atoms:
elementType: O O O O C C C C C C C C C C C C C C C C C C
charge: -0.283416 -0.284278 -0.037793 -0.037707 0.233896 0.233666 0.132780 0.133789 -0.204895 -0.204967 0.347574 0.347820 -0.090125 -0.122803 -0.089807 -0.122659 0.014687 0.035916 0.014053 0.035821 -0.025659 -0.025890
polarizability: 3.32408487e+02 1.96847672e+00 1.63471937e+02 5.83704793e+00 -3.22395311e+00 1.53239186e+02
1716.lowfreq: -8.0919 -2.2735 -0.0003 0.0002 0.0005 2.6466 4.1540 9.6707 39.9559
frequency: -7.7965 8.0992 39.9444 42.2613 42.5526 75.3099 114.5967 185.0103 188.5808 204.5382 221.8342 257.3553 262.5930 300.4543 310.3908 315.7642 322.0132 373.5123 410.3440 410.9329 413.7648 433.8407 454.2918 483.0311 486.1862 515.7247 556.6675 570.7056 607.3541 612.9090 614.0158 666.0081 681.9375 689.5488 691.5361 706.8565 736.6927 756.5857 759.5385 785.7195 806.2330 822.0444 829.3294 835.2418 844.4324 875.3141 900.3823 900.7831 965.9690 966.0241 984.7277 984.9942 985.4442 985.5546 1018.8371 1019.1428 1060.8624 1078.2850 1078.7441 1093.9301 1147.8467 1150.8787 1166.8878 1167.9756 1171.7620 1173.0611 1199.7361 1201.5635 1237.3365 1278.2147 1308.1912 1308.9120 1326.7716 1381.3683 1386.9061 1387.4537 1399.5915 1442.7493 1443.3072 1469.8509 1471.7672 1522.3196 1594.0672 1594.5440 1598.8821 1608.4203 1615.0320 1631.2694 3129.9274 3130.0088 3134.8310 3137.2096 3139.3227 3139.5595 3156.5462 3156.7290 3165.2523 3165.4298 3174.8894 3174.9365 3581.7177 3583.1832
redmass: 5.7833 5.8436 4.9014 4.3038 4.3863 5.9380 6.9880 4.8427 4.9784 6.4351 5.6945 5.8281 5.2580 7.1799 1.6097 1.6944 1.4018 7.4313 3.0780 3.0291 6.3747 3.3797 6.2898 3.2682 3.1415 5.4711 7.5057 7.1325 6.5404 6.2823 5.4324 7.6212 7.6731 2.3558 2.3493 2.7274 4.5597 1.5567 1.7627 4.7368 5.8084 1.7534 1.3126 1.3307 1.4123 4.0213 1.4184 1.4256 1.3614 1.3616 1.4502 1.5961 3.6933 3.6075 2.1570 2.1009 5.4612 1.4975 1.5164 2.0887 1.4087 1.8785 1.1285 1.1237 1.1432 1.2219 2.7356 2.3726 2.0386 1.4561 1.3407 1.3463 5.9451 8.2998 8.9457 9.8979 5.8137 2.3289 2.3366 2.2572 2.2627 3.3295 6.4703 6.4758 6.8362 6.5103 6.8417 7.6568 1.0850 1.0850 1.0913 1.0921 1.0892 1.0892 1.0928 1.0928 1.0962 1.0961 1.1001 1.1001 1.0662 1.0663
irintensity: 1.8952 0.2411 0.0294 0.2323 0.0976 1.1355 0.4094 0.6121 0.6286 1.1458 0.2121 10.9729 2.6301 0.1679 59.4850 156.3566 43.5443 11.1103 0.9459 0.9124 11.3146 23.0076 3.6394 5.1775 22.4883 0.0090 0.2147 1.3279 1.6049 0.1539 0.0021 17.3471 0.3319 32.9069 7.7691 32.8949 9.1512 127.3722 21.6101 43.7732 3.0301 5.4089 8.2410 1.0723 49.1292 83.4915 0.2307 9.8806 0.0711 0.6489 0.5726 0.4731 0.1462 0.5400 6.1087 21.2997 13.9346 5.9464 11.9889 384.8902 14.6086 66.5876 8.4426 49.5724 10.0016 159.8604 666.0785 50.2926 262.1112 7.4024 0.6604 0.6172 9.2683 17.1484 1.1583 20.0974 117.5544 1.6550 0.8932 253.6386 74.7678 339.5776 36.6774 36.6193 16.1549 110.6138 2.1076 0.1367 2.5000 2.2685 6.4287 0.1214 12.1823 12.6498 39.6711 18.9623 12.8631 16.0918 16.1978 1.7167 70.0474 9.2600
temp: 298.150 k
press: 1.00000 atm
elementType: 8 8 8 8 6 6 6 6 6 6 6 6 6 6 6 6 6 6 6 6 6 6 1 1 1 1 1 1 1 1 1 1 1 1 1 1
symmnumber: 1
zpe: 709992.6 jmol-1
zpe.correction: 0.270422 hartree
zpe.thermalcorrener: 0.288495 hartree
zpe.thermalcorrenthalpy: 0.289439 hartree
zpe.thermalcorrgfe: 0.222102 hartree
zpe.sumelectzpe: -993.629005 hartree
zpe.sumelectthermal: -993.610932 hartree
zpe.sumelectthermalent: -993.609988 hartree
zpe.sumelectthermalfe: -993.677325 hartree
dipole: 0.0309 1.4405 -0.4617
dipole: 1.5130
quadrupole: -115.1296 -123.1406 -121.3577
quadrupole: 4.8931 14.8174 0.8198
quadrupole: 4.7464 -3.2647 -1.4817 4.8931 14.8174 0.8198
hfenergy: -993.899427 hartree
pointgroup: C01 [X(C18H14O4)]
dipole: -0.0119532 -0.5951419 0.0031542 debye
polarizability: 332.1990138|0.0983994|164.3890017|-8.6955586|-0.4144085|152.5315944 unknown
InChI: InChI=1S/C18H14O4/c19-15-12-18(22-14-9-5-2-6-10-14)16(20)11-17(15)21-13-7-3-1-4-8-13/h1-12,19-20H
charge 0 multiplicity 1
36 atoms
O  -2.73631 0.983397 -0.687989
O  2.734713 0.993431 0.676702
O  -0.874665 0.887961 -2.693884
O  0.873174 0.85278 2.682972
C  -1.374984 0.872812 -0.332021
C  1.373375 0.878066 0.321314
C  -0.408526 0.884451 -1.370664
C  0.407055 0.866496 1.359841
C  -0.964071 0.873644 1.017816
C  0.962381 0.896528 -1.028313
C  -3.683181 0.046314 -0.201072
C  3.681844 0.052073 0.198479
C  -3.336184 -1.236425 0.283188
C  -5.033438 0.454846 -0.283987
C  3.333939 -1.228196 -0.291572
C  5.03302 0.454966 0.29393
C  -4.366417 -2.112219 0.695534
C  -6.048923 -0.432623 0.1302
C  4.364239 -2.107272 -0.696862
C  6.048417 -0.435636 -0.113514
C  -5.722371 -1.718183 0.625385
C  5.721065 -1.718895 -0.614231
H  -1.732683 0.882834 1.79977
H  1.731249 0.923117 -1.809622
H  -2.289035 -1.551191 0.324776
H  -5.262377 1.450841 -0.674309
H  2.285946 -1.538586 -0.343253
H  5.262607 1.449216 0.688304
H  -4.103499 -3.109514 1.065898
H  -7.096588 -0.118588 0.066255
H  4.100503 -3.102646 -1.071807
H  7.096735 -0.125896 -0.039924
H  -6.513533 -2.403635 0.946616
H  6.51223 -2.406809 -0.93015
H  -0.116015 0.927052 -3.327835
H  0.114407 0.876789 3.31753
