program: Gaussian 09
title: 000250177
version: EM64L-G09RevD.01
frameworkgroup: C1[X(C15H16N2O3S3)]
method: RPBEPBE
basis: SDD
operation: Freq
keyword: #p
keyword: freq=noraman
keyword: PBEPBE/SDD
title: #p freq=noraman PBEPBE/SDD
converged: YES YES NO NO
title: Mulliken charges:
elementType: S S S O O O N N C C C C C C C C C C C C C C C H H H H H H H H H H H H H H H H
charge: 1.002734 0.235849 0.204136 -0.546710 -0.479060 -0.284622 -0.693585 -0.476991 -0.054359 -0.281365 -0.173460 0.492341 -0.208137 -0.132104 -0.220134 0.380717 -0.399517 -0.362320 -0.151190 -0.197806 -0.265014 -0.862883 -0.868734 0.291310 0.305776 0.337865 0.250885 0.255817 0.296740 0.225201 0.306692 0.228695 0.243926 0.268706 0.270239 0.268650 0.263830 0.260970 0.266914
chargesum: 0.00000
title: Mulliken charges with hydrogens summed into heavy atoms:
elementType: S S S O O O N N C C C C C C C C C C C C C C C
charge: 1.002734 0.235849 0.204136 -0.546710 -0.479060 -0.284622 -0.355720 -0.180251 -0.054359 0.009945 0.132316 0.492341 -0.208137 0.118780 0.035682 0.380717 -0.174317 -0.055628 -0.151190 0.030889 -0.021088 -0.055288 -0.077020
polarizability: 3.72140689e+02 -2.43146997e+01 2.40298211e+02 1.24836284e+00 3.42262713e+01 1.98508841e+02
1716.lowfreq: -6.0898 -2.6810 -0.0023 -0.0015 0.0014 1.0897 10.0553 13.5433 32.0669
frequency: 10.0130 13.5035 32.0272 36.7161 42.6622 54.3350 61.8393 76.3095 96.0347 109.7578 116.6471 156.0568 168.1759 179.3036 189.2880 205.6788 219.5919 221.9762 227.7275 237.4050 265.9359 287.0142 292.6064 311.7043 341.2983 350.9754 379.5430 389.8324 399.6370 408.5537 427.8247 435.7994 481.0906 496.4611 543.0453 557.5758 601.7672 613.4985 650.6465 669.1796 675.8245 686.8976 691.7507 699.1664 704.2648 716.6170 751.8839 794.6196 812.1206 820.6107 828.9197 844.1851 869.1448 908.7989 950.7985 960.9840 963.3789 968.1670 970.4300 977.7264 978.4060 986.3175 986.9304 995.0869 1009.9952 1047.9873 1070.8650 1082.5084 1102.6233 1124.6632 1137.3978 1185.1867 1193.7144 1252.3718 1295.6987 1300.2516 1322.5506 1346.4380 1350.5387 1370.2395 1383.8902 1397.5114 1402.1037 1453.4962 1453.5928 1455.5751 1459.4263 1464.1849 1473.8666 1511.9944 1572.4268 1580.6712 1593.3330 1602.0245 1622.6096 3003.4331 3009.6094 3118.2317 3121.1497 3128.1353 3132.7734 3136.2170 3137.1309 3149.4050 3154.7136 3157.9375 3174.4775 3188.7745 3202.8762 3494.8596 3534.0049
redmass: 5.5481 4.4536 4.4987 5.6112 4.8393 3.7745 6.0205 7.7996 6.1488 6.7781 8.1890 4.7583 2.8300 5.0221 8.6651 3.6526 6.8539 1.9154 1.4667 1.5456 6.9524 6.9441 5.4088 6.1806 1.5791 4.0985 5.9679 7.6954 6.9496 3.0305 6.5609 2.9791 7.0737 3.6178 4.1036 2.8241 1.8301 7.0814 6.7348 7.1706 7.2855 2.2764 7.4759 7.1420 4.1845 5.8908 7.5217 1.3476 8.3264 1.4440 1.3815 1.6650 5.6464 1.3776 1.3611 9.8947 1.1819 1.1985 1.3977 4.6057 3.4891 1.3208 1.4476 1.5161 5.0588 3.2531 2.9307 2.0777 1.5887 1.3633 1.7830 1.0918 1.1405 2.0162 1.2512 1.5360 1.6911 1.1633 1.1761 4.0329 5.9547 4.1538 3.0750 1.7079 1.0549 1.0520 1.2522 1.1524 1.8436 2.0663 5.8252 7.5605 5.7544 6.1132 5.1696 1.0293 1.0292 1.1061 1.0908 1.1064 1.1010 1.0872 1.1021 1.0906 1.0884 1.0965 1.0953 1.0956 1.0949 1.0791 1.0762
irintensity: 0.8045 0.8792 1.4242 0.5014 0.2432 1.6388 1.8980 4.3204 3.2381 1.1960 8.3482 0.5517 0.5895 1.4163 1.4661 11.8599 0.3912 0.4782 1.1422 1.0356 16.6904 2.0696 11.2422 5.7853 16.0850 11.2520 16.3720 65.5344 71.9160 13.0971 1.1757 10.4183 10.9632 30.6691 134.0428 97.2442 68.8338 1.3111 15.1666 1.1286 14.2368 34.8649 50.8858 55.3100 4.6955 226.4363 9.4442 49.0382 161.2264 15.2936 29.6206 37.7273 11.0456 6.0300 0.8419 77.3383 8.5566 8.8859 2.3534 5.6746 6.3375 4.1102 0.9945 5.0907 43.9790 80.7554 54.5681 32.5453 22.2496 13.2118 259.8339 3.5013 19.6618 13.6283 1.1010 15.8882 318.3379 36.6299 0.3625 13.3761 280.3067 13.2328 88.7482 89.8628 12.2966 16.3139 142.4738 7.8606 111.8013 413.9650 98.6716 4.2451 91.5326 214.7123 80.9278 23.0978 21.5512 19.7196 10.3452 15.1024 10.8566 5.9967 5.9354 2.1376 3.6813 14.0353 4.9838 7.5145 7.6783 27.6956 20.6393
temp: 298.150 k
press: 1.00000 atm
elementType: 16 16 16 8 8 8 7 7 6 6 6 6 6 6 6 6 6 6 6 6 6 6 6 1 1 1 1 1 1 1 1 1 1 1 1 1 1 1 1
symmnumber: 1
zpe: 743871.1 jmol-1
zpe.correction: 0.283326 hartree
zpe.thermalcorrener: 0.307953 hartree
zpe.thermalcorrenthalpy: 0.308897 hartree
zpe.thermalcorrgfe: 0.224553 hartree
zpe.sumelectzpe: -2108.709165 hartree
zpe.sumelectthermal: -2108.684538 hartree
zpe.sumelectthermalent: -2108.683594 hartree
zpe.sumelectthermalfe: -2108.767938 hartree
dipole: 0.8218 -2.0730 5.5489
dipole: 5.9802
quadrupole: -129.4687 -170.5885 -152.5140
quadrupole: -25.9111 4.6096 11.2177
quadrupole: 21.3884 -19.7314 -1.6569 -25.9111 4.6096 11.2177
hfenergy: -2108.992491 hartree
pointgroup: C01 [X(C15H16N2O3S3)]
dipole: -0.2790143 1.9607433 1.2701386 debye
polarizability: 367.992706|-28.4118014|195.8973486|17.5855916|-32.4130661|247.0576863 unknown
InChI: InChI=1S/C15H16N2O3S3/c1-21-12-6-8-14(9-7-12)23(19,20)17-15(18)16-11-4-3-5-13(10-11)22-2/h3-10,16-17H,1-2H3
charge 0 multiplicity 1
39 atoms
S  -1.791765 -1.756516 1.174493
S  -5.583074 2.705168 -1.587873
S  7.084397 1.132779 0.504339
O  -2.232063 -1.93232 2.732039
O  -1.670328 -3.0292 0.188176
O  0.233573 -0.550099 -0.849786
N  -0.124192 -0.97447 1.415226
N  2.026383 -0.403095 0.690848
C  -2.849075 -0.424844 0.388374
C  -3.656958 0.335707 1.24703
C  -2.840592 -0.281316 -1.010233
C  3.083688 0.092899 -0.129336
C  -4.526837 1.486398 -0.735185
C  -4.505549 1.305225 0.671134
C  -3.69384 0.688022 -1.568659
C  0.6984 -0.641802 0.322315
C  4.332004 0.31861 0.514402
C  2.934519 0.354765 -1.513836
C  5.432082 0.803858 -0.221627
C  4.048925 0.843933 -2.231294
C  5.29216 1.071295 -1.608561
C  -6.521665 3.501475 -0.1718
C  6.861053 0.62494 2.29532
H  -3.638297 0.161939 2.32769
H  -2.182083 -0.892837 -1.631593
H  0.189276 -1.091517 2.386161
H  -5.142749 1.902859 1.328634
H  -3.709812 0.827442 -2.65466
H  2.280557 -0.583753 1.664012
H  4.425856 0.111554 1.587259
H  1.976351 0.172215 -2.001354
H  3.943421 1.048051 -3.302447
H  6.142562 1.447563 -2.186915
H  -5.831381 4.014984 0.515283
H  -7.129246 2.754385 0.361999
H  -7.18439 4.241501 -0.645779
H  6.600565 -0.442836 2.370505
H  6.10239 1.251891 2.790403
H  7.839834 0.795446 2.769598
