program: Gaussian 09
title: 000250171
version: EM64L-G09RevD.01
frameworkgroup: C1[X(C12H12O)]
method: RPBEPBE
basis: SDD
operation: Freq
keyword: #pfreq=noraman
keyword: PBEPBE/SDD
title: #p freq=noraman PBEPBE/SDD
converged: YES YES NO NO
title: Mulliken charges:
elementType: O C C C C C C C C C C C C H H H H H H H H H H H H
charge: -0.237092 0.025720 0.512459 -0.148055 -0.702541 -0.702559 0.068337 -0.418046 -0.382898 0.012809 -0.367732 -0.255476 -0.239270 0.228171 0.226151 0.214090 0.240927 0.226154 0.240923 0.214089 0.237893 0.255530 0.284851 0.229452 0.236112
chargesum: 0.00000
title: Mulliken charges with hydrogens summed into heavy atoms:
elementType: O C C C C C C C C C C C C
charge: -0.237092 0.025720 0.512459 0.080116 -0.021373 -0.021394 0.068337 -0.180152 -0.127368 0.012809 -0.082881 -0.026024 -0.003158
polarizability: 1.58051263e+02 -3.51469468e+00 1.52276648e+02 -6.17885892e-04 -1.43891673e-05 7.08521370e+01
1716.lowfreq: -0.0007 -0.0004 0.0004 2.5947 6.2884 9.6128 54.2401 106.6470 165.5077
frequency: 54.2230 106.6320 165.5003 206.4443 230.4458 248.2437 252.3165 295.9900 313.7535 326.6974 408.0059 452.7147 458.9073 478.1407 518.7725 551.6909 557.1429 672.0448 680.1365 720.5088 764.2800 770.1448 778.1019 848.3707 885.1331 896.8925 928.3978 930.4595 975.9867 1000.9949 1006.4021 1010.6625 1029.2361 1057.3925 1089.2906 1115.1361 1128.5898 1162.1362 1177.8194 1188.3560 1251.3053 1297.3102 1310.4428 1372.3410 1375.9047 1383.5395 1400.1545 1439.4564 1462.7007 1464.0267 1468.8271 1478.6791 1487.0757 1553.1900 1576.3161 1615.0348 1645.7011 2981.0881 2983.7385 3076.2015 3080.6247 3090.2167 3092.1432 3095.7069 3122.8387 3137.6757 3149.9432 3151.2877 3165.3789
redmass: 3.7594 3.9789 2.9291 1.9857 1.5841 1.4379 1.7784 2.8620 3.1440 4.9696 2.9368 5.2314 5.8157 2.9315 3.8603 3.0872 5.2040 5.6971 2.8853 5.7725 5.2435 2.7042 1.2804 1.9978 2.1299 1.5049 2.2599 1.5438 1.3910 1.2685 1.3394 1.3171 2.8014 3.6786 1.7141 3.6314 1.6754 1.3416 1.1089 2.2493 1.7714 2.0224 2.5185 1.7828 1.1689 6.0414 1.3199 2.4462 1.0481 1.0502 2.0280 1.0574 1.2276 8.8657 7.2560 6.4711 7.6498 1.0343 1.0347 1.1000 1.0988 1.0880 1.1012 1.1004 1.0858 1.0895 1.0938 1.0963 1.1002
irintensity: 0.8254 2.9377 0.0288 2.1873 0.5040 0.8315 0.8404 1.6885 0.3761 5.7202 2.0969 2.8396 2.2583 0.0104 0.6991 7.4887 10.8147 0.3687 1.2189 2.2537 1.5951 0.0413 108.4568 19.2750 0.5329 0.0502 14.9623 0.8162 1.8900 1.8849 0.4446 0.2420 17.6522 2.5066 15.3938 3.8623 8.1364 28.5249 0.6664 1.6195 2.4789 49.2952 40.1267 18.2800 13.9208 12.3710 8.4785 16.0401 0.0174 6.2833 0.8360 17.0095 24.6933 137.0132 22.2094 12.9488 82.9893 21.3790 40.5402 1.2266 38.8466 34.5907 14.9352 27.2620 3.9040 15.8184 8.3320 21.9328 25.7514
temp: 298.150 k
press: 1.00000 atm
elementType: 8 6 6 6 6 6 6 6 6 6 6 6 6 1 1 1 1 1 1 1 1 1 1 1 1
symmnumber: 1
zpe: 533241.1 jmol-1
zpe.correction: 0.203101 hartree
zpe.thermalcorrener: 0.214335 hartree
zpe.thermalcorrenthalpy: 0.215279 hartree
zpe.thermalcorrgfe: 0.166562 hartree
zpe.sumelectzpe: -538.770522 hartree
zpe.sumelectthermal: -538.759288 hartree
zpe.sumelectthermalent: -538.758343 hartree
zpe.sumelectthermalfe: -538.807060 hartree
dipole: 2.4802 -4.1853 -0.0003
dipole: 4.8650
quadrupole: -66.7238 -82.7050 -79.3689
quadrupole: 6.5356 0.0007 -0.0017
quadrupole: 9.5422 -6.4391 -3.1030 6.5356 0.0007 -0.0017
hfenergy: -538.9736225 hartree
pointgroup: C01 [X(C12H12O1)]
dipole: -0.5473374 1.8341069 0.0002364 debye
dipolederiv: -0.5830327 0.185284 0.0000678 -0.0029619 -1.101426 -0.0002619 -0.0000326 0.0000068 -0.346009 0.0242308 0.0940514 0.0000344 0.0969261 -0.1497256 -0.0000781 0.0000714 -0.0001157 0.1032407 0.2558696 -0.1403026 -0.0000529 0.1065971 0.0547916 0.0000772 -0.0000374 -0.0000197 -0.0854031 0.1289551 0.0714754 -0.0000145 -0.2234943 0.3796984 0.0001651 -0.0000116 0.0001157 -0.1854859 0.0304907 -0.0577658 0.0072813 -0.0039726 0.0137053 -0.034423 -0.0599954 0.0595758 0.0275093 0.0305104 -0.0577561 -0.007314 -0.0040036 0.0137589 0.0344 0.0599648 -0.0595498 0.027526 -0.3497255 -0.2567618 -0.0000709 -0.2505807 -0.408689 -0.0000868 -0.0001451 -0.0001546 0.008589 -0.2797666 -0.0558296 -0.0000166 -0.1335836 0.0898942 0.0000523 -0.0000491 0.0000617 -0.1520957 -0.4629583 0.2847697 0.0000498 0.3149128 -0.1652328 0.0000168 0.0001037 0.0000183 -0.158825 1.1875736 -0.0775936 0.0000009 0.2177371 1.2309692 0.0002702 0.0001389 0.0002175 0.1633101 0.0058996 0.1197653 0.0000432 -0.0968217 0.0779721 0.0000499 -0.0000162 0.0000463 -0.1007862 0.089057 0.0053838 0.0000247 0.0407422 0.1397543 0.0000717 0.0000276 0.0000671 -0.139546 0.138481 -0.0579768 0.0000237 -0.037561 -0.2178845 -0.0000196 0.00003 -0.0000242 -0.1682404 -0.1471932 0.0013404 0.0000041 0.0519473 0.0644909 -0.0000069 0.000017 -0.0000207 0.1133432 0.0583873 -0.1146958 0.0010098 -0.0680109 -0.114908 -0.0298963 0.0208808 -0.0087289 0.0656597 -0.1892688 0.0733367 0.0313438 0.0330862 0.0885069 -0.0214317 -0.0047681 -0.008627 0.0709173 0.0872851 0.0261653 -0.0561389 0.0123324 0.0416957 0.1018378 -0.0375213 0.0563928 -0.0795006 0.0583896 -0.1146949 -0.0010707 -0.0680016 -0.1149388 0.0298025 -0.0209224 0.0086237 0.0656827 0.0872889 0.0261346 0.0561539 0.0123151 0.0417843 -0.101775 0.037516 -0.0563181 -0.0796108 -0.1892672 0.0733476 -0.0313043 0.0330733 0.0884961 0.0214395 0.0048025 0.0086311 0.0709367 0.0581439 0.1002521 0.0000201 0.0698526 -0.0796203 -0.0000486 0.0000344 -0.0000506 0.134145 -0.0097166 -0.0602155 -0.0000145 -0.0997759 -0.0293312 -0.0000499 -0.0000195 -0.0000418 0.1776045 0.1042591 0.0126674 -0.0000008 0.0879247 0.0127103 -0.0000336 0.0000003 -0.0000399 0.1538023 -0.0021037 -0.0991253 -0.0000369 -0.1152383 -0.0397876 -0.0000572 -0.000049 -0.0000575 0.1532037 -0.131789 0.0187441 -0.0000226 0.026559 0.0833157 -0.0000145 -0.0000196 -0.0000082 0.1600325 unknown
polarizability: 156.0578789|-4.4598804|154.2700274|0.0055829|0.0179268|70.8521414 unknown
InChI: InChI=1S/C12H12O/c1-12(2)8-7-11(13)9-5-3-4-6-10(9)12/h3-8H,1-2H3
charge 0 multiplicity 1
25 atoms
O  0.219128 -3.07373 -0.00052
C  -1.416181 0.900317 0.00003
C  0.097829 0.638143 0.000021
C  -2.226126 -0.381982 -0.000296
C  -1.82246 1.715305 1.274291
C  -1.822479 1.716032 -1.273732
C  0.636787 -0.682133 -0.000266
C  1.003665 1.730501 0.000373
C  -1.707483 -1.642216 -0.000581
C  -0.250435 -1.888747 -0.000779
C  2.043472 -0.885129 -0.000156
C  2.398181 1.524956 0.000467
C  2.925231 0.208595 0.000208
H  -3.317637 -0.242681 -0.00025
H  -1.318195 2.697726 1.287331
H  -2.914072 1.89199 1.284709
H  -1.547049 1.171414 2.194379
H  -1.318251 2.69848 -1.286244
H  -1.547091 1.172682 -2.194148
H  -2.914094 1.892706 -1.284021
H  0.61821 2.756382 0.000593
H  -2.348995 -2.530736 -0.000737
H  2.405918 -1.918595 -0.000392
H  3.07505 2.38681 0.000746
H  4.008677 0.048413 0.000274
