program: Gaussian 09
title: 000250170
version: EM64L-G09RevD.01
frameworkgroup: C1[X(C8H12O4)]
method: RPBEPBE
basis: SDD
operation: Freq
keyword: #pfreq=noraman
keyword: PBEPBE/SDD
title: #p freq=noraman PBEPBE/SDD
converged: YES YES NO NO
title: Mulliken charges:
elementType: O O O O C C C C C C C C H H H H H H H H H H H H
charge: -0.264061 -0.239894 -0.278240 -0.256779 -0.457031 -0.494143 -0.074252 0.252320 -0.355832 0.237040 -0.504716 -0.506034 0.245733 0.229949 0.263239 0.249749 0.256865 0.259900 0.242490 0.243427 0.235876 0.241469 0.240708 0.232217
chargesum: 0.00000
title: Mulliken charges with hydrogens summed into heavy atoms:
elementType: O O O O C C C C C C C C
charge: -0.264061 -0.239894 -0.278240 -0.256779 0.018652 0.018844 0.182613 0.252320 -0.095932 0.237040 0.217077 0.208359
polarizability: 1.63957903e+02 1.09766731e+00 7.84912887e+01 6.91806073e+00 -3.74002753e+00 7.71737757e+01
1716.lowfreq: -0.0010 -0.0007 0.0001 2.6182 5.4053 14.7237 25.1438 31.2452 48.2547
frequency: 25.1182 31.2362 48.1871 69.3237 92.1306 102.4573 108.5967 140.1152 167.3519 185.0493 228.5499 240.3792 280.2990 307.1224 381.3594 443.0401 461.9469 564.4470 657.0953 675.6297 679.2656 775.7167 833.0951 861.3896 869.2852 948.6047 961.5883 994.5717 1015.9614 1053.6686 1093.3255 1112.9065 1113.6037 1129.4328 1138.8964 1148.7482 1149.7877 1186.8933 1250.9432 1266.5697 1295.6824 1319.7483 1355.8460 1423.1519 1423.5736 1442.0669 1451.5306 1453.7323 1461.9402 1463.2532 1464.3620 1623.0248 1645.5555 1666.8478 2984.1126 2992.8083 3001.8139 3005.5477 3049.3635 3073.5865 3090.3810 3101.4726 3107.7396 3146.7593 3151.2746 3152.9404
redmass: 5.8811 4.1752 3.2847 3.2242 1.1945 1.0928 2.5391 3.6237 3.2981 3.3670 3.0605 5.4918 3.6937 3.8811 4.1677 3.7812 4.1425 2.8706 4.6202 4.6454 4.1106 1.5128 5.9908 2.8295 3.0848 5.8013 2.5326 1.6883 1.7454 3.9413 2.4582 1.2678 1.2754 1.8089 2.5838 1.4474 1.4386 2.0468 1.2917 1.3066 1.3148 1.5313 1.6467 1.1882 1.1899 1.0793 1.0498 1.0499 1.0921 1.0522 1.0529 9.9444 9.0326 6.3634 1.0624 1.0653 1.0298 1.0297 1.0948 1.0971 1.0917 1.1042 1.1047 1.1045 1.1049 1.0924
irintensity: 2.0065 0.2040 0.4553 1.2345 1.0264 0.3410 1.8831 0.3021 1.6336 14.3911 6.0904 8.6938 26.3124 3.8528 16.5025 5.5664 0.9299 3.6725 11.5064 10.8445 5.6320 4.8549 13.5025 6.0188 9.5328 18.8721 6.3843 45.0007 44.1664 29.4285 137.4505 0.0949 6.4350 53.0016 422.9380 11.5364 6.7370 31.6390 108.4680 62.7617 4.5387 19.5724 53.5938 31.4587 15.2072 18.7215 13.9287 14.9807 17.1100 11.6598 17.3281 180.4958 169.2996 115.9779 3.3947 14.3782 38.6551 31.5414 7.3710 11.5306 11.4170 28.7566 26.8994 19.0575 15.6743 7.1654
temp: 298.150 k
press: 1.00000 atm
elementType: 8 8 8 8 6 6 6 6 6 6 6 6 1 1 1 1 1 1 1 1 1 1 1 1
symmnumber: 1
zpe: 497298.4 jmol-1
zpe.correction: 0.189411 hartree
zpe.thermalcorrener: 0.203736 hartree
zpe.thermalcorrenthalpy: 0.204680 hartree
zpe.thermalcorrgfe: 0.145452 hartree
zpe.sumelectzpe: -611.991066 hartree
zpe.sumelectthermal: -611.976741 hartree
zpe.sumelectthermalent: -611.975797 hartree
zpe.sumelectthermalfe: -612.035025 hartree
dipole: 1.1357 -0.6631 -1.6437
dipole: 2.1050
quadrupole: -51.4509 -76.5053 -72.3905
quadrupole: -7.6684 2.4725 -0.0680
quadrupole: 15.3313 -9.7231 -5.6083 -7.6684 2.4725 -0.0680
hfenergy: -612.180477 hartree
pointgroup: C01 [X(C8H12O4)]
dipole: 0.4517838 -0.1723224 -0.6723559 debye
dipolederiv: -1.3489132 0.2837842 0.2584229 0.4145277 -0.6233074 -0.230084 0.400333 -0.2253727 -0.4630243 -0.7311666 -0.1725667 -0.0722069 0.1152401 -0.7936277 -0.2824185 0.1420521 -0.2394165 -0.4493726 -1.4128157 0.1123235 -0.3746433 0.2156927 -0.4301743 0.1865076 -0.5310627 0.1635976 -0.6080847 -0.7517807 -0.1417741 0.0666714 -0.1324098 -0.6200839 0.2978631 0.0302463 0.274033 -0.627599 -0.2013288 -0.0362178 -0.0010919 -0.074715 0.0577179 -0.004862 -0.183909 -0.0369717 0.1124996 -0.3527794 -0.0852 0.0237307 -0.3396667 -0.0256826 -0.0482223 0.0894326 -0.0321638 0.1283264 0.6158223 0.0892322 0.0807557 0.1034823 -0.0460781 -0.1238534 0.2469284 -0.1011059 0.0305858 1.5532174 -0.040461 -0.1827775 -0.3286765 1.088005 0.5378775 -0.4946142 0.4952613 0.5197899 -0.9552085 -0.0686646 -0.0488472 -0.0138791 -0.0736986 -0.1192507 -0.1886113 -0.1381308 -0.0849197 1.9606571 0.0583665 0.3129251 0.0581275 0.693765 -0.4635931 0.3831999 -0.4390829 0.8453014 0.6440321 -0.0692981 -0.0781115 0.0320568 0.2268389 -0.0277476 -0.0216809 -0.0190158 0.2717217 0.7039905 -0.0003192 0.1010833 0.0741871 0.2520957 0.04561 0.0362174 0.0290346 0.2568717 0.0714958 -0.0370768 -0.0586041 -0.0167147 0.0622013 -0.063504 0.0341826 -0.0687407 -0.0174487 0.0311103 0.0269284 -0.0116259 0.0162163 -0.0160898 0.0900417 0.0444261 0.1183151 -0.0323065 0.0621459 -0.0020946 -0.0134534 0.0479832 0.0588333 -0.0673405 -0.0103453 -0.0872831 -0.0320025 0.0735379 -0.012303 0.0156852 0.0067118 0.0091455 0.0750383 -0.0033709 0.105969 0.0092226 0.0827577 -0.0198842 0.0057565 -0.0467069 0.0418038 0.1025896 -0.0015487 0.0959336 0.0444487 0.071831 -0.0383193 0.0103407 -0.0514934 0.0603003 0.1100825 0.0283338 0.110626 0.0590152 -0.0290769 0.0115854 -0.0075625 -0.0511992 0.1059869 -0.0041634 -0.101048 0.0098555 -0.0953106 -0.0157293 0.0237788 0.0123027 -0.0858825 -0.0488627 0.1161432 0.0100755 0.0811523 0.0461698 0.0035169 0.0531939 0.0442975 0.0959639 -0.0091539 -0.088398 0.0717886 -0.0834192 0.0648219 -0.0386915 0.0029529 0.0058668 -0.0319178 0.0839224 -0.0520344 0.1165908 -0.0566514 -0.08051 -0.0204001 0.0244627 -0.0146568 -0.0810274 -0.1101714 -0.0738467 0.0178456 -0.035083 0.0925607 -0.0162243 0.0375711 -0.0742576 0.0740998 0.0563144 0.087565 -0.1154617 0.0786595 0.009243 unknown
polarizability: 163.8118987|-0.5765921|79.499983|7.8138488|-3.4805123|76.3110861 unknown
InChI: InChI=1S/C8H12O4/c1-11-7(9)5-3-4-6-8(10)12-2/h3,5H,4,6H2,1-2H3
charge 0 multiplicity 1
24 atoms
O  4.014891 -0.841338 -0.523862
O  3.544908 1.120827 0.640272
O  -4.078844 0.460504 -0.789547
O  -3.410317 -0.975658 0.928931
C  0.693227 0.6595 0.340335
C  1.724843 -0.467084 0.082759
C  -0.697617 0.11127 0.52279
C  3.153543 0.054338 0.11385
C  -1.792093 0.490416 -0.193258
C  -3.123128 -0.100627 0.073358
C  5.45162 -0.466749 -0.519043
C  -5.459331 -0.047427 -0.622303
H  1.005279 1.20295 1.255194
H  0.721413 1.393242 -0.485086
H  1.544334 -0.972615 -0.881667
H  1.638103 -1.250333 0.862837
H  -0.840781 -0.65199 1.304469
H  -1.737482 1.241871 -0.988134
H  5.821911 -0.386734 0.516797
H  5.594675 0.500029 -1.030012
H  5.954504 -1.280655 -1.059232
H  -5.818546 0.148142 0.402363
H  -5.493939 -1.133675 -0.812623
H  -6.054673 0.504097 -1.363386
