program: Gaussian 09
title: 000254070
version: EM64L-G09RevD.01
frameworkgroup: C1[X(C17H19Cl2N3)]
method: RPBEPBE
basis: SDD
operation: Freq
keyword: #p
keyword: freq=noraman
keyword: PBEPBE/SDD
title: #p freq=noraman PBEPBE/SDD
converged: YES YES NO NO
title: Mulliken charges:
elementType: Cl Cl N N N C C C C C C C C C C C C C C C C C H H H H H H H H H H H H H H H H H H H
charge: -0.052526 -0.052293 -0.172967 -0.075687 -0.003393 0.478072 -0.387946 -0.388243 -0.608249 0.311978 -0.406595 0.389551 -0.428116 -0.586500 -0.586625 -0.840070 -0.298633 -0.316855 0.232994 -0.292337 -0.292261 -0.395312 0.251908 0.250715 0.252992 0.251023 0.235861 0.235024 0.224317 0.269427 0.294431 0.269212 0.295556 0.231500 0.242734 0.243456 0.289949 0.214480 0.227637 0.245441 0.246350
chargesum: 0.00000
title: Mulliken charges with hydrogens summed into heavy atoms:
elementType: Cl Cl N N N C C C C C C C C C C C C C C C C C
charge: -0.052526 -0.052293 -0.172967 -0.075687 -0.003393 0.478072 0.114677 0.115772 -0.372388 0.311978 -0.171571 0.389551 -0.203799 -0.022642 -0.021857 -0.122381 -0.008683 -0.102374 0.232994 -0.064700 -0.046820 -0.148962
polarizability: 5.37958549e+02 1.28946021e+01 2.39850935e+02 -4.24835436e+00 -2.46544806e+01 1.16899632e+02
1716.lowfreq: -4.2733 0.0009 0.0013 0.0018 2.1504 4.1296 19.5772 24.3500 28.9662
frequency: 19.5496 24.3157 28.9394 31.0250 43.5660 57.2675 62.2127 89.8682 113.6904 122.1843 154.4304 168.0378 191.7922 199.0575 208.3053 215.6981 223.5373 238.7423 248.4906 254.6192 327.2508 358.4391 381.3633 396.7932 425.6520 450.5912 473.9816 517.7516 535.1643 552.5866 561.8418 592.8364 615.4674 663.9706 671.7770 698.6860 706.5062 734.5357 778.4335 782.9421 787.9231 803.7766 808.8976 831.3614 856.3208 873.6557 887.8545 891.4739 939.5223 947.8990 949.7728 964.8193 980.5364 998.3841 1006.9970 1008.3441 1034.7571 1036.5366 1042.4068 1049.4328 1051.0646 1105.1730 1119.6850 1144.3447 1173.5117 1203.1433 1214.4066 1221.2016 1239.3303 1252.3510 1254.9398 1258.8907 1280.6999 1293.3641 1301.5635 1308.5662 1316.8397 1330.0418 1351.9591 1354.2267 1370.9722 1376.9523 1394.8220 1402.5450 1429.4265 1442.7568 1460.0540 1460.2707 1473.3055 1479.1497 1485.3598 1495.0021 1503.5471 1513.0185 1545.2591 1555.1233 1613.5816 1637.5890 2982.1037 3015.7550 3021.6331 3060.9261 3062.6432 3063.6656 3072.1056 3077.9101 3088.2648 3112.4899 3130.8712 3132.2720 3136.5672 3145.2320 3147.3527 3148.2268 3148.7338 3158.2644 3163.2176
redmass: 6.5814 4.9547 11.5358 11.9580 4.3231 6.5188 5.6739 3.8345 2.8829 2.7484 6.2330 1.4081 2.6170 3.9367 3.3015 3.6128 3.1730 4.3687 4.2306 3.8844 3.6632 2.9868 3.3713 4.1811 3.5347 2.7387 5.2969 4.2089 3.1757 4.0620 4.5189 3.0048 6.4801 7.5977 7.0579 5.3546 4.7464 2.9254 3.8743 1.1515 1.2741 2.9227 1.5106 1.4651 1.5028 4.1723 4.8836 1.8810 9.2355 1.3974 1.3811 2.1884 1.4759 1.4210 1.1774 1.5387 3.8063 3.8199 1.5788 1.9950 1.7130 2.3938 1.4470 2.3819 1.5310 1.8209 1.8272 1.8505 3.0013 1.6826 1.3488 1.1878 1.4773 1.1936 1.6857 1.9238 1.3654 2.1562 1.2788 1.4020 1.7743 2.6759 1.9375 1.3644 1.9820 2.6246 1.1090 1.0940 1.0460 1.3867 1.2648 2.3850 1.1946 2.4279 5.6018 6.1725 5.5254 5.8143 1.0375 1.0602 1.0608 1.0974 1.0574 1.0578 1.1030 1.1039 1.0989 1.0916 1.0870 1.0882 1.0868 1.0934 1.1106 1.1092 1.0918 1.0983 1.0951
irintensity: 0.0230 2.2841 1.0215 0.5864 0.4194 0.7173 0.7151 0.5746 0.9160 1.8991 0.1193 2.3799 0.5291 4.0780 0.5697 4.4450 2.7709 8.6886 3.2494 0.7963 9.7177 1.1131 3.5599 6.9454 1.5668 3.2123 6.5896 14.8816 14.9768 14.5544 3.1866 6.2673 22.8618 49.5131 46.1250 81.4453 19.3627 1.4153 0.1161 4.7725 12.9946 2.2610 20.8961 21.6464 29.4122 8.4651 3.7750 33.5894 43.0732 1.6275 0.5360 26.3808 0.4194 4.0763 38.6719 10.5978 0.3112 0.4667 5.1625 7.4575 0.6909 63.3627 40.9491 5.5646 76.4737 22.9101 40.3947 38.5584 23.6490 27.9135 11.2225 16.9163 160.3889 6.8222 15.1449 0.5990 143.4116 0.5894 37.0591 153.8301 33.6761 90.4239 120.2759 14.4941 80.9518 22.2272 18.3100 11.3397 13.8732 24.7113 39.7938 134.1070 8.9872 77.5261 934.3143 54.3438 778.6574 13.2772 17.9209 22.9287 31.0482 12.8144 12.2454 17.5954 9.1136 7.2201 20.5450 12.7870 3.4414 27.6654 6.2848 24.7122 20.3346 9.2494 41.8969 22.1970 26.8381
temp: 298.150 k
press: 1.00000 atm
elementType: 17 17 7 7 7 6 6 6 6 6 6 6 6 6 6 6 6 6 6 6 6 6 1 1 1 1 1 1 1 1 1 1 1 1 1 1 1 1 1 1 1
symmnumber: 1
zpe: 854760.8 jmol-1
zpe.correction: 0.325561 hartree
zpe.thermalcorrener: 0.347446 hartree
zpe.thermalcorrenthalpy: 0.348391 hartree
zpe.thermalcorrgfe: 0.270218 hartree
zpe.sumelectzpe: -1741.961631 hartree
zpe.sumelectthermal: -1741.939746 hartree
zpe.sumelectthermalent: -1741.938802 hartree
zpe.sumelectthermalfe: -1742.016974 hartree
dipole: -3.6058 1.4288 -0.3891
dipole: 3.8981
quadrupole: -183.4286 -149.6786 -145.4308
quadrupole: 10.6039 -3.0610 -4.1621
quadrupole: -23.9159 9.8340 14.0819 10.6039 -3.0610 -4.1621
hfenergy: -1742.2871926 hartree
pointgroup: C01 [X(C17H19Cl2N3)]
dipole: 1.4251958 0.4572164 0.3342836 debye
polarizability: 537.6116857|-13.9201554|208.7961893|-9.5654855|59.1259286|148.3012406 unknown
InChI: InChI=1S/C17H19Cl2N3/c1-14-12-17(22(10-7-18)11-8-19)5-3-15(14)2-4-16-6-9-20-13-21-16/h2-6,9,12-13H,7-8,10-11H2,1H3
charge 0 multiplicity 1
41 atoms
Cl 5.454355 3.658593 1.246853
Cl 5.94502 -3.350669 -0.912479
N  3.776156 0.038088 0.106446
N  -4.808131 -0.715204 -0.430086
N  -7.118364 -0.059825 0.036293
C  2.369465 -0.042507 0.05636
C  4.45948 1.057538 0.923116
C  4.629948 -0.888634 -0.658197
C  1.708903 -1.067399 -0.68749
C  0.304634 -1.165737 -0.759419
C  1.545844 0.900463 0.74882
C  -0.516156 -0.21442 -0.060303
C  0.151424 0.802305 0.684581
C  4.589146 2.385443 0.151913
C  4.861903 -2.19797 0.120773
C  -0.306844 -2.291623 -1.578234
C  -1.972915 -0.30282 -0.125772
C  -2.892616 0.527676 0.471514
C  -4.336093 0.341477 0.333501
C  -5.262689 1.222611 0.966293
C  -6.638688 0.981973 0.789121
C  -6.154315 -0.85169 -0.532671
H  3.925737 1.223361 1.874845
H  5.468185 0.693692 1.186732
H  4.186303 -1.109905 -1.644627
H  5.604764 -0.406915 -0.851198
H  2.294582 -1.81835 -1.226666
H  1.987908 1.712961 1.332287
H  -0.441924 1.545323 1.228201
H  5.215063 2.285788 -0.747348
H  3.612772 2.819915 -0.105621
H  5.408797 -2.033113 1.061029
H  3.928622 -2.747175 0.309844
H  0.477719 -2.920938 -2.030339
H  -0.947691 -2.946426 -0.959237
H  -0.939258 -1.9030 -2.397858
H  -2.405465 -1.119325 -0.716808
H  -2.581018 1.381026 1.087332
H  -4.912666 2.063708 1.573517
H  -7.394066 1.626701 1.25221
H  -6.516935 -1.6897 -1.137526
