program: Gaussian 09
title: 000254074
version: EM64L-G09RevD.01
frameworkgroup: C1[X(C14H15N3O3S)]
method: RPBEPBE
basis: SDD
operation: Freq
keyword: #p
keyword: freq=noraman
keyword: PBEPBE/SDD
title: #p freq=noraman PBEPBE/SDD
converged: YES YES NO NO
title: Mulliken charges:
elementType: S O O O N N N C C C C C C C C C C C C C C H H H H H H H H H H H H H H H
charge: 0.851904 -0.556350 -0.546248 -0.348665 -0.277310 -0.359335 -0.677381 -0.134475 -0.236819 -0.208713 0.455016 -0.372776 -0.376426 0.184358 0.242435 0.307809 -0.800763 -0.300727 -0.387182 -0.294372 -0.191308 0.294002 0.288686 0.298129 0.241975 0.239599 0.354285 0.240313 0.229742 0.229244 0.233483 0.223837 0.236542 0.231030 0.307658 0.378805
chargesum: 0.00000
title: Mulliken charges with hydrogens summed into heavy atoms:
elementType: S O O O N N N C C C C C C C C C C C C C C
charge: 0.851904 -0.556350 -0.546248 -0.348665 0.020819 -0.005050 0.009082 -0.134475 0.057184 0.079973 0.455016 -0.130801 -0.136827 0.184358 0.242435 0.307809 -0.101464 -0.067245 -0.163345 -0.057830 0.039721
polarizability: 3.84413208e+02 -2.35364990e+01 2.36084090e+02 1.00207459e+01 1.32794072e+01 1.39584892e+02
1716.lowfreq: -10.2574 -2.5574 -0.0018 -0.0013 0.0009 7.0710 13.6097 25.8245 30.7132
frequency: 13.4603 25.7023 30.4726 49.0494 52.8039 57.5697 82.8187 104.4771 113.4507 137.7014 149.9670 197.3992 214.9546 220.8856 259.1175 271.7072 296.5435 322.4482 341.2691 366.3809 378.2106 394.3632 406.1864 411.7457 424.9055 445.3788 478.9974 499.7043 506.7729 520.7668 553.4606 579.3508 621.6527 655.2052 663.1272 683.3880 705.7908 712.8323 750.5778 762.5263 773.5485 776.9053 807.6972 822.0823 846.5203 848.6723 849.5167 887.9272 940.0415 956.5083 964.1644 980.0843 983.7852 989.4368 991.8316 999.1928 1024.8062 1048.3540 1048.8619 1060.3834 1119.0306 1157.2465 1170.2710 1181.3987 1188.1088 1218.3222 1267.7843 1289.3895 1299.3911 1330.6263 1345.2250 1379.7982 1391.1775 1398.1072 1404.4341 1436.8830 1471.0204 1471.4146 1472.7296 1476.2046 1502.6243 1547.5585 1574.9420 1591.2104 1593.9685 1619.4050 1633.8648 2979.2251 3061.4874 3091.4296 3124.9390 3130.3288 3132.9942 3134.4341 3148.5783 3150.2446 3158.9809 3173.3367 3187.6238 3413.7629 3560.8687 3646.5709
redmass: 5.3043 4.9719 4.8587 4.8966 4.8602 1.1093 6.1894 6.7474 6.1316 6.3801 8.6359 5.2136 6.9138 4.8998 6.3576 5.9196 4.7958 5.0019 6.4396 3.8709 4.3628 6.0357 2.9543 5.0625 4.9027 2.8443 1.4463 3.1042 3.2237 3.0337 6.6607 5.9984 6.9350 2.4140 3.4882 2.4139 3.3359 1.2138 2.0628 3.8843 2.6739 4.3392 4.5685 1.3571 2.8368 1.4952 1.6047 11.1445 1.3840 1.2966 1.2687 1.3550 1.3845 2.1821 2.2862 4.7613 2.0097 2.0746 1.7899 1.7205 1.2940 1.5813 2.0477 1.0909 1.1677 3.0166 3.8483 1.8739 1.2629 2.0106 1.6095 6.7399 2.8618 1.2223 5.8829 2.7786 1.8514 1.1081 2.2830 1.0652 2.2208 2.4233 5.7922 6.8190 5.9969 1.3873 6.1660 1.0389 1.0946 1.1000 1.0869 1.0880 1.0892 1.0889 1.0948 1.0967 1.0960 1.0996 1.0716 1.0551 1.0787 1.0955
irintensity: 0.4527 1.0922 0.4112 1.4904 0.7063 0.2508 2.1664 2.2538 14.0021 1.4194 12.7254 11.1260 5.0791 2.1283 19.5095 3.2192 3.9289 2.5576 20.8290 5.2739 19.2337 10.7254 0.7547 0.8713 55.5979 17.2035 80.5264 35.6142 52.8876 27.5800 3.1470 15.4843 0.4217 11.9454 5.0242 54.1075 0.5259 92.0163 67.7880 88.4866 6.5386 13.2362 21.3676 43.0786 1.8458 8.2876 8.4203 58.4299 1.1383 60.6530 39.5911 1.9986 2.5007 15.0334 16.1224 37.1565 16.3432 10.6375 30.5927 8.6315 13.1036 99.8898 152.0925 54.9533 5.1526 6.0527 281.8058 8.7327 3.9262 16.2951 309.5934 0.5197 8.0929 14.4116 37.2647 25.8054 24.6334 22.2180 32.6328 12.7439 152.1259 174.5691 77.0370 1.5821 5.3020 179.8864 173.7528 31.4669 20.8524 15.2664 8.3334 8.6177 11.5450 0.8650 30.2067 8.1969 19.6965 19.2496 33.4897 67.0967 56.5955 73.6683
temp: 298.150 k
press: 1.00000 atm
elementType: 16 8 8 8 7 7 7 6 6 6 6 6 6 6 6 6 6 6 6 6 6 1 1 1 1 1 1 1 1 1 1 1 1 1 1 1
symmnumber: 1
zpe: 709926.1 jmol-1
zpe.correction: 0.270397 hartree
zpe.thermalcorrener: 0.291253 hartree
zpe.thermalcorrenthalpy: 0.292198 hartree
zpe.thermalcorrgfe: 0.217772 hartree
zpe.sumelectzpe: -1328.800746 hartree
zpe.sumelectthermal: -1328.779889 hartree
zpe.sumelectthermalent: -1328.778945 hartree
zpe.sumelectthermalfe: -1328.853370 hartree
dipole: -2.1708 6.2943 1.0382
dipole: 6.7386
quadrupole: -92.3648 -127.3594 -137.0791
quadrupole: 6.5643 2.6389 0.8874
quadrupole: 26.5696 -8.4249 -18.1447 6.5643 2.6389 0.8874
hfenergy: -1329.0711427 hartree
pointgroup: C01 [X(C14H15N3O3S1)]
dipole: -1.4918857 2.0287222 0.8289649 debye
polarizability: 384.6313243|23.7752709|229.2510209|-9.474594|27.1372451|146.1998452 unknown
InChI: InChI=1S/C7H8N3O.C7H7O2S/c8-6-4-2-1-3-5(6)7(11)10-9;1-6-2-4-7(5-3-6)10(8)9/h1-4,9-10H,8H2;2-5H,1H3
charge 0 multiplicity 1
36 atoms
S  1.605568 -1.29612 -0.395893
O  0.236126 -1.101724 -1.312635
O  2.741945 -2.386173 -0.852249
O  -1.145804 0.39362 1.554781
N  0.427868 -1.870589 1.545148
N  -0.827956 -1.830703 1.035829
N  -3.650993 1.358474 1.32147
C  2.478209 0.386151 -0.34205
C  3.867383 0.406035 -0.5451
C  1.715347 1.542179 -0.107909
C  3.796205 2.85952 -0.289821
C  4.518536 1.659522 -0.522005
C  2.391599 2.781953 -0.088127
C  -2.880359 -0.70443 0.221029
C  -1.604435 -0.633468 0.934644
C  -3.89205 0.29856 0.473699
C  4.511311 4.19743 -0.234244
C  -3.145013 -1.73268 -0.73491
C  -5.162368 0.162006 -0.171598
C  -4.386635 -1.833795 -1.374334
C  -5.404031 -0.885868 -1.068275
H  4.406532 -0.528484 -0.732964
H  0.632115 1.484516 0.047052
H  0.561613 -0.939793 2.023936
H  5.601181 1.7036 -0.688501
H  1.819113 3.700603 0.085455
H  -1.142312 -2.690707 0.58295
H  4.7960 4.449167 0.805871
H  5.437302 4.188385 -0.834735
H  3.869553 5.015758 -0.604881
H  -2.339969 -2.414894 -1.031257
H  -5.94241 0.905129 0.032537
H  -4.565153 -2.616318 -2.11729
H  -6.381776 -0.960356 -1.557375
H  -4.388105 2.026721 1.53179
H  -2.702137 1.475771 1.695463
