program: Gaussian 09
title: 000254057
version: EM64L-G09RevD.01
frameworkgroup: C1[X(C17H14Cl2O)]
method: RPBEPBE
basis: SDD
operation: Freq
keyword: #p
keyword: freq=noraman
keyword: PBEPBE/SDD
title: #p freq=noraman PBEPBE/SDD
converged: YES YES NO NO
title: Mulliken charges:
elementType: Cl Cl O C C C C C C C C C C C C C C C C C H H H H H H H H H H H H H H
charge: -0.053601 -0.053603 -0.173481 -0.274600 -0.274643 -0.596594 -0.596617 0.114468 0.517242 0.517277 -0.424930 -0.424934 -0.384413 -0.384418 -0.216501 -0.216507 -0.231123 -0.231113 -0.112598 -0.112596 0.262589 0.262591 0.268974 0.272995 0.268960 0.273013 0.238455 0.238455 0.249792 0.249804 0.256127 0.256126 0.257703 0.257704
chargesum: 0.00000
title: Mulliken charges with hydrogens summed into heavy atoms:
elementType: Cl Cl O C C C C C C C C C C C C C C C C C
charge: -0.053601 -0.053603 -0.173481 -0.012011 -0.012051 -0.054625 -0.054644 0.114468 0.517242 0.517277 -0.186475 -0.186479 -0.134621 -0.134614 0.039626 0.039619 0.026580 0.026590 -0.112598 -0.112596
polarizability: 2.99708036e+02 2.87502465e-03 1.97536584e+02 1.82133313e+01 -3.45587725e-03 1.04132553e+02
1716.lowfreq: 0.0012 0.0023 0.0028 5.8051 8.4725 16.3981 30.3803 37.8226 47.1679
frequency: 30.3774 37.3338 47.1426 51.3326 63.8162 70.9469 147.2939 158.4415 173.6259 203.6619 266.1199 270.8914 310.2549 316.6227 345.0068 365.1903 406.2500 410.2028 410.3739 430.9988 454.5981 473.4568 504.6738 534.0267 612.0185 613.4231 624.7302 628.3635 667.6804 718.2697 718.8912 735.2099 756.9269 768.4892 796.0323 809.9277 832.1136 832.9893 838.6588 889.9411 897.1229 952.6725 956.0610 964.5976 969.2837 970.0706 998.6885 999.8211 1000.7675 1047.0019 1076.0793 1077.2907 1094.2182 1115.1517 1121.5508 1139.0917 1154.9882 1169.9534 1192.5027 1193.4613 1210.3158 1218.4764 1243.5471 1268.8837 1277.1125 1298.3094 1302.3606 1324.4963 1328.6534 1378.3406 1382.3308 1400.9145 1402.9757 1443.0099 1443.7238 1480.1971 1480.3705 1584.4843 1584.5442 1600.2342 1600.9835 1658.0081 3002.8700 3003.8954 3030.8626 3034.8302 3080.7736 3081.4738 3122.0008 3122.7233 3138.8621 3139.0269 3168.8629 3168.9066 3171.8311 3171.8726
redmass: 6.9657 8.2391 4.3485 6.2730 6.7398 8.1122 8.7614 6.4387 6.3843 5.1198 4.5991 4.8076 4.4303 4.9829 6.4872 4.5652 5.8424 2.9907 2.9344 5.1609 3.0080 2.4831 3.2298 2.8434 5.0349 5.2473 7.0691 4.8116 4.0573 3.9028 4.5348 2.9949 4.2744 4.4356 2.9842 1.7182 1.3076 1.2546 1.5287 2.0480 2.7402 1.3544 1.4073 2.1550 1.4027 1.3632 2.6482 4.2623 2.8763 3.3376 2.7629 2.7075 1.2393 1.4012 1.2651 4.0823 1.3000 1.5626 1.1335 1.1285 1.9603 1.7957 1.4514 1.5037 1.5521 1.3337 1.3021 1.8378 2.0950 5.1682 4.6075 2.4705 2.1594 1.0770 1.0970 2.3806 2.4131 7.1304 7.1924 6.1106 6.1682 12.0909 1.0653 1.0660 1.0850 1.0867 1.0967 1.0959 1.0898 1.0899 1.0891 1.0891 1.0949 1.0949 1.0960 1.0960
irintensity: 0.2729 0.9302 0.0992 2.1925 2.6764 0.0398 0.0081 0.2898 0.8761 0.2046 7.2996 0.1081 0.4860 0.4934 3.5651 0.1941 6.5748 0.6334 0.0038 4.1068 19.3004 3.0418 0.3827 42.7421 38.6574 2.6009 0.5830 0.0567 1.0038 3.0125 0.8661 6.5768 3.9397 15.3468 0.1908 0.4409 21.1328 0.0978 96.0632 1.6220 0.0686 1.6881 0.6429 28.8700 3.2565 0.0088 78.0746 6.4532 16.4884 0.2865 78.4002 6.2619 6.4084 5.1079 10.6417 83.8337 0.0038 7.2900 0.7356 0.0041 0.1864 2.0826 1.6911 5.9438 1.7389 0.7230 2.2299 7.1101 0.0444 0.4048 0.0007 0.5328 9.0056 50.7158 12.8810 11.8969 180.6427 2.7644 0.1119 0.3263 8.6454 199.9667 4.0309 9.4190 24.1924 9.2769 21.3987 1.4556 20.9104 6.0843 7.8974 10.1611 0.5262 10.8035 0.5405 0.0217
temp: 298.150 k
press: 1.00000 atm
elementType: 17 17 8 6 6 6 6 6 6 6 6 6 6 6 6 6 6 6 6 6 1 1 1 1 1 1 1 1 1 1 1 1 1 1
symmnumber: 1
zpe: 680482.2 jmol-1
zpe.correction: 0.259182 hartree
zpe.thermalcorrener: 0.276453 hartree
zpe.thermalcorrenthalpy: 0.277398 hartree
zpe.thermalcorrgfe: 0.211653 hartree
zpe.sumelectzpe: -1650.145500 hartree
zpe.sumelectthermal: -1650.128229 hartree
zpe.sumelectthermalent: -1650.127285 hartree
zpe.sumelectthermalfe: -1650.193030 hartree
dipole: -0.0009 -2.0747 0.0000
dipole: 2.0747
quadrupole: -154.4816 -137.5074 -131.9273
quadrupole: -0.0033 -0.1508 -0.0015
quadrupole: -13.1762 3.7980 9.3782 -0.0033 -0.1508 -0.0015
hfenergy: -1650.4046824 hartree
pointgroup: C01 [X(C17H14Cl2O1)]
dipole: -0.0003338 0.8162392 0.00009 debye
polarizability: 298.7134323|-0.0026132|197.5365837|-22.9184719|0.0065542|105.1271572 unknown
InChI: InChI=1S/C17H14Cl2O/c18-13-5-1-11(2-6-13)16-9-15(20)10-17(16)12-3-7-14(19)8-4-12/h1-8,16-17H,9-10H2
charge 0 multiplicity 1
34 atoms
Cl -6.270873 1.439414 0.421737
Cl 6.270914 1.439385 -0.421294
O  0.000509 -3.766327 -0.000439
C  -0.41043 -0.18812 -0.687914
C  0.410411 -0.188254 0.687906
C  -0.172538 -1.614548 -1.236682
C  0.172444 -1.614776 1.236389
C  0.000204 -2.513115 -0.000262
C  -1.877186 0.1693 -0.447611
C  1.877186 0.169169 0.447717
C  -2.255924 1.537667 -0.431483
C  2.255922 1.537539 0.431735
C  -2.881392 -0.802041 -0.197624
C  2.881411 -0.802146 0.19769
C  -3.584423 1.936124 -0.169763
C  3.584435 1.936027 0.17013
C  -4.217727 -0.425664 0.06885
C  4.217757 -0.425734 -0.068679
C  -4.549117 0.941444 0.081681
C  4.549144 0.941376 -0.081362
H  0.025825 0.572736 -1.358941
H  -0.025836 0.572488 1.359067
H  0.776327 -1.654559 -1.806831
H  -0.961536 -1.997144 -1.905074
H  -0.776664 -1.654887 1.806138
H  0.961186 -1.997415 1.905048
H  -1.503553 2.309272 -0.637039
H  1.503537 2.309122 0.63732
H  -2.641731 -1.870835 -0.219869
H  2.641771 -1.870947 0.219833
H  -3.864291 2.993495 -0.167491
H  3.864297 2.9934 0.167973
H  -4.983828 -1.183148 0.258338
H  4.983872 -1.183196 -0.258198
