program: Gaussian 09
title: 000254045
version: EM64L-G09RevD.01
frameworkgroup: C1[X(C9H6ClN7S2)]
method: RPBEPBE
basis: SDD
operation: Freq
keyword: #p
keyword: freq=noraman
keyword: PBEPBE/SDD
title: #p freq=noraman PBEPBE/SDD
converged: NO YES NO NO
title: Mulliken charges:
elementType: Cl S S N N N N N N N C C C C C C C C C H H H H H H
charge: 0.009230 0.221131 0.221131 -0.301560 -0.301561 0.027589 -0.029744 -0.029744 0.050887 0.050887 0.106594 0.106594 -0.169781 -0.169780 -0.297821 -0.478218 -0.478218 -0.161193 -0.161193 0.358442 0.358442 0.272539 0.272539 0.261404 0.261404
chargesum: 0.00000
title: Mulliken charges with hydrogens summed into heavy atoms:
elementType: Cl S S N N N N N N N C C C C C C C C C
charge: 0.009230 0.221131 0.221131 0.056881 0.056881 0.027589 -0.029744 -0.029744 0.050887 0.050887 0.106594 0.106594 -0.169781 -0.169780 -0.297821 -0.205679 -0.205679 0.100211 0.100211
polarizability: 2.95518881e+02 1.24325167e-04 2.89057978e+02 7.57777290e-02 -1.12877522e-02 6.73034927e+01
1716.lowfreq: -26.4946 -17.6165 -4.1442 -0.0011 0.0021 0.0023 0.6993 4.0911 42.5280
frequency: -26.3869 -17.5983 42.5280 46.8675 52.9352 95.3578 158.4511 172.3353 173.6114 174.2835 201.7545 250.8788 265.4645 274.9755 282.1648 411.5134 431.6739 500.8097 503.2399 524.8963 529.4710 585.8447 587.0626 599.1434 621.1506 629.6764 639.3055 684.9906 688.1481 694.1881 710.9087 717.1337 722.0124 776.1454 796.0062 816.5022 828.7044 838.6598 856.3122 862.5144 863.8261 905.8584 954.8578 1017.2048 1051.6236 1079.1203 1111.3105 1186.0613 1200.9695 1229.3888 1229.4304 1276.3227 1277.4797 1354.3108 1363.2268 1458.7106 1460.9042 1489.9504 1491.6414 1534.3174 1549.1831 1581.2735 1595.2799 3203.8746 3204.0363 3255.1022 3255.1186 3523.7741 3524.4645
redmass: 8.9738 11.5274 8.2103 5.7884 9.0447 8.7548 12.5885 10.0843 13.3881 7.6534 12.1658 12.8462 12.6845 5.8410 5.0215 17.3710 11.0678 4.6745 4.6907 13.2345 13.0113 4.9159 4.9980 10.7155 3.6129 9.8998 1.8335 8.3167 1.6399 7.5614 1.6344 1.2716 1.6907 8.4417 8.0049 7.5472 6.0417 6.7488 11.5309 1.3291 1.3255 12.5941 5.8180 2.4651 1.5473 1.3995 2.7088 6.9317 8.2089 2.8241 2.3905 1.7075 1.7767 3.9293 6.5158 5.2226 5.2868 6.5544 3.4236 2.0470 2.4377 11.1461 10.5944 1.0920 1.0921 1.1011 1.1011 1.0760 1.0760
irintensity: 0.0000 0.5347 0.3967 0.0000 0.3300 0.0180 1.3442 0.0002 0.0087 0.2129 0.0078 5.6303 5.5813 0.0001 10.3415 10.6791 2.8289 0.0000 3.5591 1.9345 57.5852 0.0001 27.3921 16.9370 58.0191 29.0320 0.0004 15.9887 211.0502 0.5357 0.0001 56.9855 0.0001 22.2332 55.9978 59.0059 0.0365 3.5228 11.3471 0.0000 4.3993 89.4087 79.0075 16.4781 16.5720 55.8386 94.0945 15.5402 254.8001 34.9730 3.5921 0.1057 17.4930 15.9585 713.2787 206.3509 2.4034 2547.5718 33.8866 27.4197 145.9040 1.2393 671.6916 5.3559 10.3191 2.6792 0.1769 94.0388 52.0507
temp: 298.150 k
press: 1.00000 atm
elementType: 17 16 16 7 7 7 7 7 7 7 6 6 6 6 6 6 6 6 6 1 1 1 1 1 1
symmnumber: 1
zpe: 406588.2 jmol-1
zpe.correction: 0.154861 hartree
zpe.thermalcorrener: 0.169753 hartree
zpe.thermalcorrenthalpy: 0.170697 hartree
zpe.thermalcorrgfe: 0.110817 hartree
zpe.sumelectzpe: -1984.633836 hartree
zpe.sumelectthermal: -1984.618945 hartree
zpe.sumelectthermalent: -1984.618001 hartree
zpe.sumelectthermalfe: -1984.677880 hartree
dipole: 0.0000 -3.5433 -0.0008
dipole: 3.5433
quadrupole: -108.1230 -125.8033 -133.9358
quadrupole: 0.0000 0.0016 0.0032
quadrupole: 14.4977 -3.1826 -11.3151 0.0000 0.0016 0.0032
hfenergy: -1984.7886977 hartree
pointgroup: C01 [X(C9H6Cl1N7S2)]
dipole: 0.0001404 -1.3940462 0.0000929 debye
dipolederiv: -0.1234399 0.000107 -0.0000026 0.0001073 -1.1849138 -0.0013681 0.0000042 -0.0051446 -0.0769832 -0.6704977 0.1242628 -0.0009512 -0.2257045 -0.0874315 -0.0004837 -0.0013901 -0.0000294 0.1127725 -0.6705195 -0.1243809 -0.0008425 0.2255842 -0.0874118 0.0004269 -0.0014505 -0.0001945 0.112773 -1.6914516 0.9725909 -0.0003689 1.042394 -1.1600999 -0.0000608 -0.0007973 0.0007682 -0.3100499 -1.691048 -0.9726968 -0.0000525 -1.0424983 -1.160505 -0.0000119 0.0001133 0.0005132 -0.3100497 -2.1859131 -0.0001857 -0.0002594 -0.0001847 -0.3342506 0.0000452 -0.000463 -0.0003625 -0.1398282 -1.3156249 -0.4921562 -0.0013634 -0.7366742 -1.6615744 -0.0004976 0.0010527 -0.000416 -0.1605928 -1.3158716 0.4922262 0.0010353 0.7367455 -1.6613296 -0.000409 -0.001709 -0.0003541 -0.1605923 -0.4888182 -0.2392191 -0.0009152 -0.1065481 -0.6013476 -0.0006869 -0.000513 -0.0008287 -0.1414443 -0.4888878 0.2392414 -0.0007873 0.1065704 -0.6012767 0.0005685 -0.0007404 0.0005401 -0.1414435 2.712058 -0.8899994 0.0002025 -0.5137309 1.3722768 -0.0002974 0.0010714 -0.0007561 0.2238358 2.7117775 0.8902701 0.0001705 0.5139967 1.372557 -0.0002016 0.0002831 0.0002049 0.2238355 1.3812489 -0.2567076 0.0017427 -0.7542017 1.1662935 0.0006205 0.0020397 0.0004032 0.0153192 1.3810444 0.2567501 0.0015179 0.7542473 1.1664972 -0.0004583 0.0013426 -0.0004033 0.0153175 1.7137579 -0.0000808 0.000286 -0.0000812 2.5045224 0.0027476 0.0005833 0.0056677 0.0560607 0.0319424 0.0903083 0.0005767 0.4263872 -0.0203234 0.000724 0.0009292 0.0003308 -0.332496 0.032048 -0.0902982 0.0004474 -0.4263753 -0.0204262 -0.0007389 0.0009496 -0.0003161 -0.332496 -0.0483004 0.0822711 0.0003144 -0.0463175 0.250067 0.0001928 -0.0002097 0.0004741 -0.0786305 -0.0482925 -0.0823301 0.0002505 0.0462568 0.2500592 -0.0002122 -0.0000838 -0.0003841 -0.0786303 0.222068 0.0288 -0.0001036 0.0441144 0.2140382 0.0000025 -0.0003254 0.0002597 0.321029 0.2220834 -0.0287993 -0.0000657 -0.0441137 0.2140236 0.0000273 -0.0001402 -0.0000389 0.3210296 0.0797045 0.0310639 -0.000214 0.0394736 0.0406479 -0.0001024 -0.0001401 -0.0001377 0.2393131 0.0797186 -0.0310564 -0.0001578 -0.0394657 0.0406332 0.0001527 -0.0000599 0.0001981 0.239313 0.0856177 -0.1042456 -0.0002499 -0.0025377 -0.0053739 -0.0001889 -0.0002009 -0.0002648 0.1913189 0.085596 0.1042642 -0.0002102 0.002556 -0.0053516 0.0002096 -0.0001458 0.0002706 0.191319 unknown
polarizability: 295.5188333|0.000502|289.0579694|0.1288132|0.0458162|67.3035491 unknown
InChI: InChI=1S/C9H6ClN7S2/c10-5-13-6(16-8-11-1-3-18-8)15-7(14-5)17-9-12-2-4-19-9/h1-4,16-17H
charge 0 multiplicity 1
25 atoms
Cl -0.000514 5.060654 0.003402
S  4.601196 -1.028631 0.00285
S  -4.601001 -1.029561 -0.002153
N  2.396202 0.682211 0.000597
N  -2.396355 0.681732 -0.00055
N  -0.000061 0.524303 -0.000438
N  -1.207197 2.654638 -0.00132
N  1.20665 2.654879 -0.000524
N  2.000009 -1.730159 -0.001857
N  -1.999669 -1.730558 0.001748
C  1.139191 1.267277 0.000173
C  -1.139461 1.267049 -0.000391
C  2.765351 -0.662382 0.000163
C  -2.76523 -0.662937 -0.000059
C  -0.000332 3.249369 -0.003287
C  4.132621 -2.76522 0.00068
C  -4.13207 -2.766054 0.000193
C  2.756904 -2.90786 -0.001536
C  -2.756324 -2.908413 0.001854
H  3.144761 1.381474 0.00122
H  -3.145055 1.380843 -0.001054
H  4.901076 -3.53422 0.001237
H  -4.900369 -3.535211 0.000081
H  2.232007 -3.86339 -0.0031
H  -2.231231 -3.863835 0.003373
