program: Gaussian 09
title: 000254056
version: EM64L-G09RevD.01
frameworkgroup: C1[X(C17H14Cl2O)]
method: RPBEPBE
basis: SDD
operation: Freq
keyword: #p
keyword: freq=noraman
keyword: PBEPBE/SDD
title: #p freq=noraman PBEPBE/SDD
converged: YES YES NO NO
title: Mulliken charges:
elementType: Cl Cl O C C C C C C C C C C C C C C C C C H H H H H H H H H H H H H H
charge: -0.057758 -0.057758 -0.173695 -0.256221 -0.256221 -0.585790 -0.585791 0.096737 0.611935 0.611935 -0.389221 -0.389219 -0.350029 -0.350032 -0.227947 -0.227947 -0.264202 -0.264201 -0.233098 -0.233098 0.276950 0.276950 0.269673 0.275986 0.269673 0.275985 0.239622 0.239622 0.257080 0.257080 0.234189 0.234189 0.237310 0.237310
chargesum: 0.00000
title: Mulliken charges with hydrogens summed into heavy atoms:
elementType: Cl Cl O C C C C C C C C C C C C C C C C C
charge: -0.057758 -0.057758 -0.173695 0.020729 0.020729 -0.040131 -0.040132 0.096737 0.611935 0.611935 -0.389221 -0.389219 -0.110407 -0.110410 0.029133 0.029133 -0.030012 -0.030012 0.004212 0.004212
polarizability: 2.44350445e+02 1.34209579e-04 2.11958121e+02 3.41743557e+01 2.15244516e-04 1.23940919e+02
1716.lowfreq: -6.4293 -0.0010 -0.0002 0.0023 5.1411 9.5144 26.1238 29.3163 54.9559
frequency: 26.1136 29.2385 54.9472 60.7699 64.8013 101.3816 145.6912 159.3926 162.3726 190.5595 240.8415 242.7936 293.6672 310.3215 365.4709 388.9780 393.9205 405.7653 434.7756 448.0589 462.2640 467.0530 516.5987 537.7337 571.5388 594.6490 643.9445 660.3003 669.4585 718.3512 733.7989 742.6050 745.5337 757.9846 761.4888 781.3935 798.1401 848.4733 866.5820 885.0826 898.2782 947.8246 949.8620 961.8575 986.4734 986.5245 999.7837 1015.2309 1016.1335 1034.2981 1045.9487 1049.7554 1101.9965 1124.6625 1130.9803 1148.5556 1168.6630 1173.5086 1175.1635 1175.9653 1207.0483 1215.4963 1249.6597 1261.4054 1279.2970 1283.6865 1302.3953 1322.7206 1336.0460 1378.8594 1384.8606 1425.4092 1425.8972 1438.2242 1439.9923 1463.8268 1465.8834 1573.2712 1574.2506 1603.6125 1604.0619 1653.1279 3004.7272 3006.1191 3066.9519 3068.5623 3078.0993 3078.2280 3131.2433 3131.4144 3144.6455 3144.7649 3159.7941 3159.8601 3175.4028 3175.4721
redmass: 7.9947 7.5461 9.1748 7.4978 5.0429 4.6924 15.1638 5.1938 4.7642 7.5105 4.0739 3.4017 3.6428 4.7141 5.0748 5.9791 9.6693 6.9147 3.3886 3.2869 2.5888 3.1561 3.9443 4.8690 3.7386 4.1235 5.7102 6.1872 3.7370 4.3046 4.0998 3.3635 3.5114 1.2529 1.5666 3.3055 3.3107 1.6609 1.3942 1.8958 2.9983 1.3936 1.4059 2.3164 1.3284 1.3287 2.4350 5.4052 6.9065 2.9037 2.1783 2.5382 1.2343 1.9423 1.6629 3.1575 1.1690 1.4219 1.1014 1.1285 1.6844 1.6749 1.6038 1.5324 1.5749 1.5764 1.3797 1.6838 2.1233 3.9061 2.7992 2.0950 1.9242 1.0851 1.1399 2.3718 2.4501 5.8415 5.8237 6.8701 6.9488 12.1275 1.0644 1.0654 1.0857 1.0868 1.0957 1.0965 1.0861 1.0860 1.0898 1.0899 1.0948 1.0948 1.0999 1.0999
irintensity: 0.1754 1.7636 0.1315 4.0024 1.5435 0.0057 0.3147 0.0378 0.1969 1.2305 0.7849 5.2553 0.1507 6.3606 0.9225 1.1664 5.0539 1.4391 15.0342 0.2582 6.0342 0.1604 2.6637 0.2788 6.5013 11.0390 8.1734 22.7831 10.2403 5.3760 5.0198 0.0547 20.6971 9.4249 98.4400 32.5495 4.1825 0.2600 0.0521 0.9811 0.4490 1.7361 0.0166 10.9254 0.0243 0.0227 20.4430 43.1039 57.2268 0.2211 7.4202 0.0633 0.0621 21.9115 0.3873 64.4192 0.2728 8.6590 1.0075 0.1358 3.9728 4.6492 0.6703 3.6942 1.6849 1.2757 6.0438 6.1855 7.4440 0.3162 0.0692 15.5607 18.0543 43.8110 16.2619 6.9796 71.9831 3.6995 10.8865 2.3969 1.6800 202.3729 5.6145 6.7715 7.1207 0.0292 1.4747 21.6405 6.3949 1.7605 9.7034 12.2648 10.9202 16.6286 26.8740 0.1929
temp: 298.150 k
press: 1.00000 atm
elementType: 17 17 8 6 6 6 6 6 6 6 6 6 6 6 6 6 6 6 6 6 1 1 1 1 1 1 1 1 1 1 1 1 1 1
symmnumber: 1
zpe: 680607.1 jmol-1
zpe.correction: 0.259230 hartree
zpe.thermalcorrener: 0.276517 hartree
zpe.thermalcorrenthalpy: 0.277461 hartree
zpe.thermalcorrgfe: 0.212152 hartree
zpe.sumelectzpe: -1650.143266 hartree
zpe.sumelectthermal: -1650.125978 hartree
zpe.sumelectthermalent: -1650.125034 hartree
zpe.sumelectthermalfe: -1650.190344 hartree
dipole: 0.0000 -0.7529 0.0000
dipole: 0.7529
quadrupole: -106.4254 -147.4128 -131.3263
quadrupole: -0.0002 8.0437 0.0001
quadrupole: 21.9628 -19.0247 -2.9381 -0.0002 8.0437 0.0001
hfenergy: -1650.4024952 hartree
pointgroup: C01 [X(C17H14Cl2O1)]
dipole: 0.0000548 -0.2962143 -0.0000341 debye
polarizability: 228.0284532|-0.0051187|211.9581177|53.5425287|0.0175709|140.2629147 unknown
InChI: InChI=1S/C17H14Cl2O/c18-16-7-3-1-5-12(16)14-9-11(20)10-15(14)13-6-2-4-8-17(13)19/h1-8,14-15H,9-10H2
charge 0 multiplicity 1
34 atoms
Cl -1.595492 -2.811771 1.032838
Cl 1.596278 -2.811002 -1.033604
O  -0.00061 3.759907 0.000531
C  -0.593144 0.1667 0.540026
C  0.593055 0.167034 -0.53997
C  -0.592806 1.61215 1.101418
C  0.592281 1.612647 -1.10095
C  -0.000397 2.505951 0.000363
C  -1.923212 -0.236663 -0.092628
C  1.923245 -0.236108 0.092568
C  -2.460683 -1.543363 0.029892
C  2.461095 -1.54262 -0.030304
C  -2.691617 0.682344 -0.862314
C  2.691379 0.68291 0.86251
C  -3.66866 -1.940164 -0.577571
C  3.669182 -1.939239 0.577059
C  -3.902608 0.313494 -1.48358
C  3.902474 0.314241 1.483683
C  -4.393738 -1.004249 -1.346468
C  4.393985 -1.003324 1.346216
H  -0.35036 -0.56278 1.328745
H  0.35049 -0.562293 -1.328898
H  0.067129 1.686193 1.987556
H  -1.583465 1.980091 1.416973
H  -0.067681 1.686738 -1.987063
H  1.582826 1.98098 -1.416403
H  -2.341759 1.715555 -0.96492
H  2.341219 1.71599 0.9654
H  -4.035044 -2.962205 -0.445208
H  4.035861 -2.961138 0.44442
H  -4.462263 1.052378 -2.066618
H  4.46191 1.053127 2.066927
H  -5.333375 -1.303989 -1.821931
H  5.333703 -1.302922 1.821606
