program: Gaussian 09
title: 000254077
version: EM64L-G09RevD.01
frameworkgroup: C1[X(C21H30O2)]
method: RPBEPBE
basis: SDD
operation: Freq
keyword: #pfreq=noraman
keyword: PBEPBE/SDD
title: #p freq=noraman PBEPBE/SDD
converged: YES YES NO NO
title: Mulliken charges:
elementType: O O C C C C C C C C C C C C C C C C C C C C C H H H H H H H H H H H H H H H H H H H H H H H H H H H H H H
charge: -0.454642 -0.253361 0.384912 -0.187184 -0.132926 -0.138909 0.221380 -0.540805 -0.548999 -0.517617 -0.065777 0.150294 -0.488944 -0.793848 -0.696500 0.560859 -0.817391 -0.768672 -0.786933 -0.180461 -0.640733 -0.411340 0.176544 0.222655 0.220372 0.236317 0.220067 0.197061 0.215837 0.222559 0.225155 0.212513 0.228425 0.244925 0.214483 0.208651 0.243209 0.218355 0.225835 0.237042 0.214910 0.244674 0.225270 0.235332 0.227093 0.215318 0.247354 0.225230 0.228230 0.236400 0.323689 0.262110 0.251980
chargesum: 0.00000
title: Mulliken charges with hydrogens summed into heavy atoms:
elementType: O O C C C C C C C C C C C C C C C C C C C C C
charge: -0.130952 -0.253361 0.384912 0.035470 0.087446 0.097409 0.221380 -0.123677 -0.110603 -0.079949 0.162648 0.150294 -0.029535 -0.123633 -0.233623 0.560859 -0.132538 -0.090929 -0.086119 0.055939 -0.378624 -0.159359 0.176544
polarizability: 2.88201977e+02 2.89914482e+00 2.05476985e+02 -2.23259253e+01 1.69043822e+00 1.81716469e+02
1716.lowfreq: -10.1706 -7.9041 -0.0006 0.0003 0.0005 5.8664 32.7118 48.6692 71.0719
frequency: 32.6737 48.4452 71.0532 76.7914 105.0376 130.3394 172.7852 176.5261 182.6421 193.5352 201.3006 218.2287 234.8630 242.9413 252.8438 262.4248 276.6219 279.2334 296.2754 299.5450 312.5870 325.9802 349.3198 365.5677 377.8308 385.7186 406.5464 420.3327 439.1102 444.7024 472.1551 479.4315 499.6101 515.6358 531.5585 557.9868 566.0790 581.1893 612.8020 661.3742 689.0307 694.4363 718.2717 748.4877 786.1724 792.8687 820.4502 831.1364 846.5701 854.6794 872.3043 888.4374 902.3922 909.4348 916.8156 930.8932 938.5284 940.5573 956.1758 959.7815 986.1940 994.3119 998.0267 1009.0768 1014.0000 1040.8288 1050.5783 1053.4678 1068.2339 1075.6874 1088.5491 1090.4169 1103.9032 1111.8940 1122.1660 1136.9152 1147.2082 1155.4310 1157.0095 1181.7002 1196.9724 1213.7224 1220.6952 1229.5993 1241.9925 1246.6688 1248.7078 1260.7727 1275.3785 1279.1349 1283.3546 1290.5980 1303.5510 1314.7088 1321.2983 1330.1070 1334.5907 1337.4347 1343.6523 1350.0825 1359.6117 1362.8849 1379.8153 1388.5649 1389.8987 1391.3719 1394.3653 1455.2748 1461.3443 1464.0298 1467.6127 1469.5760 1471.0995 1474.9756 1477.8943 1478.8011 1479.8252 1486.9136 1489.1702 1493.9046 1556.1654 1608.2521 1658.1063 2939.2674 2952.7561 2958.8368 2964.2652 2968.9301 2972.8413 2980.7978 2984.2066 2989.8303 2991.2597 2994.8528 3000.5185 3015.5700 3018.2752 3039.2509 3045.8972 3051.0149 3061.9487 3069.7950 3079.2590 3080.2498 3081.5099 3086.5519 3088.0041 3088.8448 3095.9218 3105.8924 3126.8679 3148.6745 3539.9186
redmass: 6.3923 3.5872 3.8041 2.4436 2.6583 3.2003 1.7030 1.2439 3.3194 2.9983 2.7933 1.9059 2.0685 1.5012 1.9003 2.5442 1.4053 2.2978 2.6785 1.1102 3.3503 2.3151 3.1015 3.1554 2.5470 2.5807 2.6706 3.1079 3.4922 2.7300 3.1075 4.2060 3.7350 2.9743 2.8416 3.2123 3.8509 3.0350 4.0446 4.6606 2.6296 2.9878 3.4214 3.3678 1.6200 2.5001 1.6302 1.9647 2.3850 2.1709 2.0463 2.4344 2.3395 1.7324 1.9033 1.8325 1.9936 1.6612 1.9843 1.8018 2.1822 1.5672 1.8603 1.7374 2.2609 2.1624 1.7675 2.0187 1.8729 1.6283 1.8394 2.3089 2.1470 2.5302 1.7438 2.2732 1.9855 1.6932 2.3574 1.6320 1.5938 1.7433 1.6187 1.4431 1.5159 1.6699 1.4511 1.5177 1.4537 1.3724 1.4847 2.2908 1.3436 1.4498 1.9428 1.3876 1.4080 1.3258 1.5161 1.6115 1.5761 1.4143 1.6263 1.4286 1.2685 1.2307 1.2247 1.0712 1.0907 1.0776 1.0674 1.0552 1.0671 1.0533 1.0622 1.0665 1.0496 1.0599 1.0831 1.0641 8.5947 8.5158 7.3146 1.0792 1.0811 1.0601 1.0678 1.0804 1.0390 1.0479 1.0655 1.0403 1.0600 1.0554 1.0406 1.0648 1.0988 1.0982 1.1001 1.1010 1.0975 1.0985 1.0998 1.1018 1.0994 1.0978 1.0992 1.1000 1.0983 1.0858 1.0918 1.0975 1.0657
irintensity: 3.2095 1.1603 0.8828 0.4417 0.6404 1.2095 2.6661 0.0570 0.7913 0.3646 1.1644 1.8927 3.0489 1.6230 4.6172 9.0114 3.8007 13.1496 2.6153 90.9150 4.8123 8.2881 6.6231 2.5600 6.1570 3.7389 3.4676 0.8068 3.0922 0.4999 11.3062 6.7567 9.9382 2.7938 1.6330 2.5166 0.0511 1.4536 1.0187 3.8561 6.1961 7.5887 0.8985 0.4951 3.3476 4.3377 19.3901 1.1585 3.6754 1.6281 6.1920 4.3519 43.6420 27.2070 7.7035 8.1804 12.6654 1.4202 0.9700 5.6119 2.0672 2.0069 7.0850 8.5506 4.6738 2.3930 11.7532 5.1698 2.4641 49.6060 45.7130 1.8415 4.1299 10.0469 3.4714 34.0014 0.6318 5.6882 0.7747 6.2331 14.9397 0.4025 6.6901 12.3110 3.1060 17.7749 2.8429 1.2549 18.1955 21.4332 0.7149 25.5589 1.2630 2.7673 17.5902 1.9810 1.6461 0.9059 1.5196 4.5400 1.0885 6.1612 20.9293 6.2244 34.4340 4.4579 35.7717 1.8668 18.3869 14.6480 15.7476 11.5382 1.9391 9.0577 0.9316 2.4055 1.8867 7.7549 13.6318 6.0572 184.4277 16.4483 164.2564 4.3304 0.4895 37.5397 18.8547 13.3697 27.5533 43.6658 20.6762 16.8872 70.1381 18.7289 36.0952 35.1242 31.5999 24.8375 22.7939 54.2439 22.5757 37.6308 38.9429 37.5069 34.2086 39.9161 14.3185 27.2475 31.7419 15.2159 10.6858 16.5745 3.9059
temp: 298.150 k
press: 1.00000 atm
elementType: 8 8 6 6 6 6 6 6 6 6 6 6 6 6 6 6 6 6 6 6 6 6 6 1 1 1 1 1 1 1 1 1 1 1 1 1 1 1 1 1 1 1 1 1 1 1 1 1 1 1 1 1 1
symmnumber: 1
zpe: 1210901.6 jmol-1
zpe.correction: 0.461208 hartree
zpe.thermalcorrener: 0.483415 hartree
zpe.thermalcorrenthalpy: 0.484359 hartree
zpe.thermalcorrgfe: 0.412690 hartree
zpe.sumelectzpe: -966.895702 hartree
zpe.sumelectthermal: -966.873495 hartree
zpe.sumelectthermalent: -966.872551 hartree
zpe.sumelectthermalfe: -966.944220 hartree
dipole: -4.4935 -0.8991 1.4602
dipole: 4.8096
quadrupole: -191.7742 -128.9919 -140.9134
quadrupole: 0.7617 17.7075 2.6711
quadrupole: -37.8810 24.9013 12.9798 0.7617 17.7075 2.6711
hfenergy: -967.3569096 hartree
pointgroup: C01 [X(C21H30O2)]
dipole: -1.7647753 -0.3535205 0.5840535 debye
polarizability: 288.1782023|3.0361103|205.6119232|-22.3444884|0.7248378|181.6053066 unknown
InChI: InChI=1S/C21H30O2/c1-13-11-14-12-15(22)5-8-19(14,2)16-6-9-20(3)17(18(13)16)7-10-21(20,4)23/h5,8,12-13,16-18,23H,6-7,9-11H2,1-4H3
charge 0 multiplicity 1
53 atoms
O  -5.127921 -0.96872 0.013965
O  5.625981 0.031971 -1.384576
C  -2.592506 -0.624668 0.127285
C  -1.776708 0.691318 -0.08127
C  -0.374121 0.660312 0.565932
C  0.431747 -0.548627 -0.021726
C  -3.970839 -0.224283 -0.543851
C  -1.795039 -1.780318 -0.522745
C  -2.766749 1.809481 0.335082
C  -0.366997 -1.882162 0.079241
C  0.387771 2.014115 0.414684
C  1.900274 -0.652992 0.604234
C  -4.165757 1.266073 -0.105651
C  -2.853275 -0.934935 1.627681
C  1.787504 1.882568 1.091737
C  2.559966 0.724369 0.497738
C  -4.000716 -0.385182 -2.079145
C  0.523943 2.518861 -1.042245
C  1.849147 -1.077592 2.116212
C  2.696507 -1.726051 -0.116209
C  3.756267 0.917168 -0.141598
C  3.886612 -1.515132 -0.746342
C  4.509118 -0.170083 -0.799489
H  -1.612031 0.785645 -1.177094
H  -0.503036 0.498259 1.657184
H  0.582432 -0.344728 -1.10412
H  -1.705133 -1.609951 -1.613908
H  -2.312975 -2.752589 -0.387163
H  -2.530533 2.778934 -0.13872
H  -2.730705 1.969216 1.429691
H  -0.437953 -2.201357 1.135532
H  0.177914 -2.681802 -0.456551
H  -0.183156 2.776945 0.982925
H  -4.89916 1.290401 0.71829
H  -4.590944 1.858617 -0.935027
H  -1.915816 -1.017807 2.203366
H  -3.478894 -0.161576 2.103585
H  -3.399272 -1.889093 1.730165
H  1.63598 1.727269 2.179582
H  2.357565 2.822377 0.97309
H  -3.886998 -1.443449 -2.384394
H  -4.972566 -0.023668 -2.459403
H  -3.202696 0.195053 -2.576392
H  1.090085 1.813605 -1.676695
H  -0.462763 2.686194 -1.509252
H  1.06725 3.482018 -1.060638
H  2.860164 -1.02453 2.556401
H  1.181531 -0.424163 2.703983
H  1.489699 -2.115993 2.221769
H  2.282419 -2.742257 -0.072804
H  -5.10307 -1.897947 -0.331917
H  4.205173 1.916618 -0.2024
H  4.437285 -2.328729 -1.233232
