program: Gaussian 09
title: 000250143
version: EM64L-G09RevD.01
frameworkgroup: C1[X(C16H22O2)]
method: RPBEPBE
basis: SDD
operation: Freq
keyword: #pfreq=noraman
keyword: PBEPBE/SDD
title: #p freq=noraman PBEPBE/SDD
converged: YES YES NO NO
title: Mulliken charges:
elementType: O O C C C C C C C C C C C C C C C C H H H H H H H H H H H H H H H H H H H H H H
charge: -0.283735 -0.267817 -0.262511 -0.033495 -0.445251 -0.450144 -0.396943 -0.392016 0.556685 -0.536009 -0.473411 0.425387 0.312346 -0.220583 -0.429726 -0.494745 -0.824252 -0.665965 0.210856 0.237358 0.220792 0.209082 0.216233 0.208641 0.192786 0.205857 0.199067 0.206583 0.242376 0.232522 0.220801 0.231160 0.238385 0.246974 0.219875 0.232668 0.237662 0.220755 0.214691 0.237064
chargesum: 0.00000
title: Mulliken charges with hydrogens summed into heavy atoms:
elementType: O O C C C C C C C C C C C C C C C C
charge: -0.283735 -0.267817 -0.051655 0.203863 -0.015377 -0.025270 0.001700 0.013634 0.556685 -0.293633 -0.240889 0.425387 0.312346 0.000218 -0.198567 -0.009387 -0.134047 0.006545
polarizability: 2.02145908e+02 -3.28258263e+00 1.56949747e+02 -2.53292118e+00 1.24275161e+01 1.57524450e+02
1716.lowfreq: -10.1836 -0.0004 0.0004 0.0006 4.8505 10.8651 13.1221 23.9434 34.4326
frequency: -6.6399 23.6361 34.3768 46.7766 60.9241 72.7150 92.3371 96.9312 162.4395 191.5885 203.8956 207.7904 218.8332 238.0694 276.6935 311.8613 317.4149 346.1240 397.6404 434.4613 444.1401 450.9724 475.5850 518.4390 532.3843 562.8932 578.4270 625.6444 641.5029 711.7119 737.2017 790.4916 792.0622 794.9766 822.0950 843.3754 860.0931 885.7978 900.7670 903.9154 911.4222 942.2907 957.3015 979.8622 984.3933 992.0792 1013.6410 1017.6961 1047.1486 1050.1860 1064.1255 1077.9269 1083.7078 1091.3911 1104.8354 1119.0188 1134.8205 1138.3732 1167.0497 1185.2342 1211.0375 1228.7948 1243.6120 1244.5156 1256.6119 1281.0442 1296.5237 1306.8061 1320.0327 1324.0220 1330.8246 1338.7933 1342.2004 1351.8177 1373.9269 1381.6525 1396.8917 1398.2099 1433.3458 1444.2966 1464.2001 1464.8714 1469.4383 1471.3770 1472.3970 1475.4174 1477.4806 1482.7599 1486.8750 1598.5188 1617.1056 1638.2283 2969.3293 2970.7809 2974.3397 2974.7700 2978.8763 2985.9957 2993.0770 2996.7513 3026.1714 3034.4569 3038.2332 3045.4655 3055.0421 3055.2137 3057.3936 3084.1146 3091.5977 3103.2045 3111.7857 3117.2671 3122.9913 3148.8462
redmass: 2.1776 3.6010 3.5088 5.4046 1.0602 3.1379 3.3404 3.3399 3.5484 1.2904 2.4974 2.9573 3.6807 4.0074 3.6514 3.0207 2.1108 2.6799 4.1438 2.7438 2.9787 2.8560 2.9376 4.9802 2.6296 3.3561 3.6163 4.3295 4.0895 2.0240 3.5401 1.4310 1.5369 1.7345 3.2335 1.9480 2.3487 2.2604 1.3588 1.7807 1.5245 2.6302 2.2664 1.3518 2.2246 4.4371 1.8857 1.9227 1.7160 1.5740 1.4220 2.3343 1.8172 1.7472 2.4309 1.8914 2.3643 2.5095 1.5567 1.1405 1.5401 1.3537 1.2391 1.2554 2.2515 1.3396 1.2504 1.4674 1.3278 1.3341 1.4184 1.4105 1.6517 1.5801 1.9161 3.2145 1.2132 1.2397 2.2344 1.0848 1.0945 1.0904 1.1345 1.1450 1.0449 1.2437 1.1076 1.0536 1.6694 5.8274 5.9703 9.4014 1.0727 1.0638 1.0389 1.0620 1.0722 1.0626 1.0609 1.0392 1.0850 1.0955 1.0993 1.1017 1.0956 1.0956 1.1020 1.0997 1.1005 1.1000 1.0861 1.0906 1.0915 1.0992
irintensity: 0.2315 0.0659 0.0523 3.7057 0.0857 1.8937 0.8523 0.7238 1.5885 0.3823 0.9452 1.4635 0.8371 1.9888 8.4206 1.3313 0.2001 3.9316 5.2115 0.4900 4.5565 9.4349 1.8147 0.6334 1.6462 2.5680 1.0885 0.9589 1.2073 27.3819 4.8638 11.2858 38.8198 2.5383 6.1438 7.6961 9.5060 4.0988 2.0430 4.2588 4.9758 16.6621 11.2742 0.0734 25.9652 6.2813 5.9337 70.9413 3.6025 16.5007 6.7834 79.2899 0.6012 5.7646 0.4211 67.5436 59.2013 177.7923 1.3800 0.3961 0.9993 0.1058 0.5897 2.8274 0.0220 1.2839 0.0852 3.7797 4.4685 3.0046 13.3529 0.6404 27.5107 7.2225 0.1002 0.2288 15.7569 18.4300 2.8439 23.1453 3.2575 10.2069 19.1017 14.4633 10.8764 2.5655 11.1200 14.0812 21.7252 8.5045 22.6372 131.9498 7.2537 35.9771 29.1436 36.1763 28.2261 23.8342 21.7708 22.7529 33.8071 55.1513 41.4235 27.2808 8.2626 15.6912 60.1822 18.1511 31.9814 29.8615 0.8473 15.0191 27.4428 31.0894
temp: 298.150 k
press: 1.00000 atm
elementType: 8 8 6 6 6 6 6 6 6 6 6 6 6 6 6 6 6 6 1 1 1 1 1 1 1 1 1 1 1 1 1 1 1 1 1 1 1 1 1 1
symmnumber: 1
zpe: 898567.9 jmol-1
zpe.correction: 0.342246 hartree
zpe.thermalcorrener: 0.359845 hartree
zpe.thermalcorrenthalpy: 0.360789 hartree
zpe.thermalcorrgfe: 0.295236 hartree
zpe.sumelectzpe: -772.006815 hartree
zpe.sumelectthermal: -771.989217 hartree
zpe.sumelectthermalent: -771.988272 hartree
zpe.sumelectthermalfe: -772.053826 hartree
dipole: 0.8047 -0.8353 -1.1064
dipole: 1.6029
quadrupole: -98.7003 -108.4762 -107.7625
quadrupole: -1.5361 0.2992 -3.8414
quadrupole: 6.2794 -3.4965 -2.7829 -1.5361 0.2992 -3.8414
hfenergy: -772.3490619 hartree
pointgroup: C01 [X(C16H22O2)]
dipole: 0.047205 -0.3891757 0.4939955 debye
polarizability: 166.808175|21.8529121|188.2580207|6.9968261|-10.8324983|161.5539086 unknown
InChI: InChI=1S/C16H22O2/c1-3-16(17)18-15-10-5-4-9-14(15)13-8-6-7-12(2)11-13/h6-8,11,14-15H,3-5,9-10H2,1-2H3
charge 0 multiplicity 1
40 atoms
O  -1.812206 0.109814 0.513035
O  -1.876441 1.134627 -1.589476
C  0.072952 -1.459256 0.693544
C  -1.230496 -1.142591 -0.071786
C  0.640721 -2.816035 0.166245
C  -2.278216 -2.258741 0.067843
C  -0.392279 -3.960508 0.287221
C  -1.709196 -3.6051 -0.442168
C  1.123086 -0.350866 0.618005
C  1.425003 0.31255 -0.597702
C  1.855682 0.002208 1.779769
C  2.42937 1.310656 -0.675338
C  -2.06147 1.181573 -0.350607
C  2.861962 0.990523 1.721633
C  3.146887 1.643864 0.501248
C  -2.556282 2.384148 0.437839
C  2.73155 1.996597 -1.997406
C  -3.244874 3.438765 -0.447652
H  -0.20114 -1.602936 1.759472
H  -1.027415 -0.949746 -1.142278
H  1.56274 -3.0591 0.727124
H  0.940425 -2.692047 -0.894706
H  -3.188609 -1.980729 -0.495162
H  -2.564213 -2.350481 1.13433
H  -0.607474 -4.148579 1.359443
H  0.032873 -4.896395 -0.123625
H  -1.518006 -3.536267 -1.532837
H  -2.459986 -4.405325 -0.30024
H  0.86032 0.071574 -1.507454
H  1.627704 -0.492559 2.732287
H  3.417577 1.259256 2.627583
H  3.923458 2.417548 0.461692
H  -3.220209 2.024853 1.244346
H  -1.672134 2.820496 0.944706
H  3.273601 2.94644 -1.846248
H  3.361049 1.3558 -2.645226
H  1.804458 2.214848 -2.557415
H  -4.165726 3.035848 -0.904614
H  -3.51481 4.326751 0.150817
H  -2.579335 3.755121 -1.268448
