program: Gaussian 09
title: 000250137
version: EM64L-G09RevD.01
frameworkgroup: C1[X(C15H21NO)]
method: RPBEPBE
basis: SDD
operation: Freq
keyword: #p
keyword: freq=noraman
keyword: PBEPBE/SDD
title: #p freq=noraman PBEPBE/SDD
converged: YES YES NO NO
title: Mulliken charges:
elementType: O N C C C C C C C C C C C C C C C H H H H H H H H H H H H H H H H H H H H H
charge: -0.284415 -0.274075 -0.042626 -0.412857 -0.412868 -0.398973 -0.399004 -0.393355 0.357979 0.186263 -0.480239 -0.337805 -0.337940 -0.677599 -0.228625 -0.228640 -0.235421 0.254900 0.204414 0.204170 0.204144 0.204450 0.198270 0.199882 0.199880 0.198266 0.201485 0.189917 0.239747 0.239776 0.252343 0.252313 0.204740 0.228758 0.228979 0.230885 0.230883 0.231999
chargesum: 0.00000
title: Mulliken charges with hydrogens summed into heavy atoms:
elementType: O N C C C C C C C C C C C C C C C
charge: -0.284415 -0.274075 0.212274 -0.004272 -0.004274 -0.000822 -0.000859 -0.001953 0.357979 0.186263 -0.000716 -0.085462 -0.085627 -0.015122 0.002259 0.002242 -0.003422
polarizability: 1.66444554e+02 1.53086393e+01 1.80821016e+02 -3.65961505e-02 1.90047041e-02 1.46912082e+02
1716.lowfreq: -11.7154 -0.0006 0.0001 0.0006 5.5056 6.3566 16.6664 24.8978 48.3848
frequency: 16.6500 24.2980 48.2894 65.3059 76.7723 89.0740 91.5168 173.2099 183.4981 223.2889 244.1477 253.0448 266.8939 288.8044 332.5304 391.3987 412.0676 419.5143 446.0727 464.8093 472.8416 513.1858 561.4500 618.5341 619.3709 641.6111 705.4270 724.3886 774.8196 788.4742 792.7841 797.7180 843.6314 852.4188 866.9023 897.5301 920.2554 923.2999 934.5997 964.4984 978.4334 990.1191 995.7408 1013.6689 1023.5754 1044.7371 1048.8722 1060.9078 1072.9417 1074.1875 1075.9243 1096.1481 1111.1608 1150.2104 1171.4232 1177.1121 1193.2189 1227.6579 1234.2756 1250.0538 1258.7936 1260.2692 1265.3906 1301.8593 1311.2630 1329.1854 1334.6771 1339.3622 1344.2245 1352.4722 1353.1759 1370.5425 1380.6982 1392.6837 1434.2244 1444.4626 1461.8372 1462.3450 1464.0815 1464.6726 1469.7177 1478.2638 1478.6790 1482.0242 1584.1585 1587.4021 1609.0161 2968.2385 2969.4375 2970.1457 2971.2083 2973.1664 2985.3002 2996.6320 3011.2372 3027.5780 3030.3212 3031.5865 3036.7254 3038.1446 3049.7332 3091.7861 3104.2754 3126.9022 3134.1756 3147.0023 3154.6285 3167.6872
redmass: 2.8420 2.9885 2.7828 4.2643 2.8029 3.5600 4.2006 2.8360 1.1700 1.8165 4.1162 4.0513 3.6346 3.7329 1.8328 5.3604 2.9140 3.3363 3.0276 2.1692 4.0259 2.1919 3.2653 6.3277 4.3147 3.5571 1.7796 3.3627 2.0378 1.4295 2.7945 1.3704 2.1573 1.2373 2.0385 1.5691 1.7915 1.5058 2.2886 2.8666 1.3738 6.0208 1.3157 1.9109 2.0103 2.0786 2.2965 1.2180 1.5456 1.4090 1.4029 2.9189 2.5913 2.4191 1.0542 1.1162 1.5806 1.6887 3.8213 1.1750 1.3627 1.2595 1.4946 1.3666 1.3308 1.4689 1.3551 1.4677 1.5469 1.7983 1.3291 7.9643 1.7196 1.2137 2.2125 1.1002 1.0908 1.0865 1.0902 1.0401 1.0863 1.1039 1.1020 2.1768 7.6694 6.3143 6.3967 1.0614 1.0588 1.0606 1.0635 1.0658 1.0591 1.0377 1.0842 1.0983 1.0948 1.0988 1.1013 1.1040 1.1024 1.0997 1.1001 1.0847 1.0882 1.0926 1.0969 1.1017
irintensity: 0.0807 0.1084 0.0019 0.2430 4.5454 0.4008 0.0614 1.2459 0.4638 0.0442 0.0932 4.3207 0.5400 5.7594 0.3803 11.6620 0.1172 0.8422 5.5946 2.2259 2.0131 6.9096 3.2550 0.1047 4.8091 14.4250 58.6981 15.4935 18.1009 0.2207 0.5545 12.3154 3.5439 0.1233 3.9618 16.6370 0.2079 0.6522 2.4554 7.3879 0.0317 0.7265 0.0339 13.4251 3.9512 3.4590 27.4529 1.0787 6.6371 0.5995 6.9565 9.8445 0.0470 19.0816 0.0002 0.7608 0.4697 51.8154 170.9025 0.5069 13.1291 1.2848 44.7725 0.1688 1.1387 38.0093 0.5379 0.1831 7.7045 37.7783 0.1442 0.6890 30.1727 27.6687 5.8329 24.5992 5.5371 0.8618 6.3579 11.8704 28.5199 0.3705 14.2392 62.9336 261.4747 3.9458 7.1478 31.7176 2.4693 72.4570 45.8332 1.6256 32.5862 32.9486 39.2957 78.4575 58.2523 8.2421 8.7221 1.8362 99.6992 29.9164 30.2195 1.4772 2.9351 23.5217 24.1883 13.0346
temp: 298.150 k
press: 1.00000 atm
elementType: 8 7 6 6 6 6 6 6 6 6 6 6 6 6 6 6 6 1 1 1 1 1 1 1 1 1 1 1 1 1 1 1 1 1 1 1 1 1
symmnumber: 1
zpe: 859616.7 jmol-1
zpe.correction: 0.327411 hartree
zpe.thermalcorrener: 0.344156 hartree
zpe.thermalcorrenthalpy: 0.345100 hartree
zpe.thermalcorrgfe: 0.280807 hartree
zpe.sumelectzpe: -712.898674 hartree
zpe.sumelectthermal: -712.881929 hartree
zpe.sumelectthermalent: -712.880984 hartree
zpe.sumelectthermalfe: -712.945278 hartree
dipole: -0.6662 -4.0791 -0.0002
dipole: 4.1332
quadrupole: -97.4357 -111.7566 -96.4987
quadrupole: 3.6242 -0.0102 0.0029
quadrupole: 4.4613 -9.8596 5.3983 3.6242 -0.0102 0.0029
hfenergy: -713.2260848 hartree
pointgroup: C01 [X(C15H21N1O1)]
dipole: -0.2102584 1.6124605 -0.0025566 debye
polarizability: 165.4735473|-14.8138426|181.7919519|0.0665407|-0.0420707|146.9121538 unknown
InChI: InChI=1S/C15H21NO/c1-2-15(17)16(13-9-5-3-6-10-13)14-11-7-4-8-12-14/h3,5-6,9-10,14H,2,4,7-8,11-12H2,1H3
charge 0 multiplicity 1
38 atoms
O  -0.361693 -2.954564 0.000305
N  -0.215158 -0.62456 -0.0025
C  1.282601 -0.688799 -0.00204
C  1.896304 -0.064748 -1.28024
C  1.895782 -0.060004 1.274084
C  3.437689 -0.213658 -1.276972
C  3.437164 -0.208966 1.27199
C  4.06043 0.406336 -0.003494
C  -0.866386 0.668542 -0.004946
C  -0.944579 -1.825853 -0.001185
C  -2.475693 -1.700194 -0.002051
C  -1.186778 1.310398 1.217833
C  -1.188371 1.30496 -1.23015
C  -3.171303 -3.072511 0.001867
C  -1.820492 2.573058 1.214733
C  -1.822139 2.567594 -1.231847
C  -2.13953 3.205073 -0.00976
H  1.501143 -1.774098 0.000017
H  1.634871 1.011615 -1.333985
H  1.465054 -0.556406 -2.173474
H  1.464135 -0.548294 2.168971
H  1.634387 1.01657 1.323694
H  3.861509 0.260218 -2.183406
H  3.70161 -1.290236 -1.324161
H  3.701048 -1.285365 1.323265
H  3.860615 0.268247 2.176846
H  5.157548 0.258105 -0.002997
H  3.88213 1.501793 -0.005546
H  -2.788425 -1.108639 -0.884686
H  -2.789183 -1.103013 0.876482
H  -0.939399 0.811994 2.161441
H  -0.942055 0.802423 -2.171849
H  -4.269304 -2.946009 -0.000288
H  -2.883352 -3.658083 0.891214
H  -2.880463 -3.664453 -0.882284
H  -2.06541 3.060896 2.164719
H  -2.068312 3.051194 -2.183675
H  -2.631593 4.183937 -0.011621
