program: Gaussian 09
title: 000250135
version: EM64L-G09RevD.01
frameworkgroup: C1[X(C15H20O4)]
method: RPBEPBE
basis: SDD
operation: Freq
keyword: #pfreq=noraman
keyword: PBEPBE/SDD
title: #p freq=noraman PBEPBE/SDD
converged: YES YES NO NO
title: Mulliken charges:
elementType: O O O O C C C C C C C C C C C C C C C H H H H H H H H H H H H H H H H H H H H
charge: -0.252050 -0.278510 -0.243157 -0.216311 -0.150643 0.444023 -0.487060 -0.495417 -0.347586 -0.345564 0.294258 0.276385 -0.399694 -0.364818 -0.683387 -0.682660 -0.233638 -0.226400 -0.232741 0.278986 0.241544 0.242477 0.244844 0.242700 0.210443 0.227534 0.214675 0.223199 0.264532 0.260357 0.209585 0.208903 0.223156 0.209825 0.208745 0.225132 0.230292 0.227673 0.230367
chargesum: 0.00000
title: Mulliken charges with hydrogens summed into heavy atoms:
elementType: O O O O C C C C C C C C C C C C C C C
charge: -0.252050 -0.278510 -0.243157 -0.216311 0.128344 0.444023 -0.003039 -0.007874 0.090391 0.092311 0.294258 0.276385 -0.135162 -0.104461 -0.041743 -0.038958 -0.003346 0.001273 -0.002374
polarizability: 1.85879537e+02 -1.52401991e+01 1.94088367e+02 1.74938391e+01 1.48220132e+01 1.39904840e+02
1716.lowfreq: -9.0506 -2.0958 -0.0006 -0.0005 -0.0004 5.4722 14.5879 19.0163 23.4138
frequency: 13.7522 18.8046 23.3328 36.4078 42.3155 48.6203 57.3725 60.4654 90.1081 95.9819 124.1205 155.7984 182.4881 213.5810 229.2510 230.4570 245.2735 269.8683 281.8170 317.1646 338.5059 353.0434 402.1655 431.8321 530.2436 533.6643 556.7301 558.1851 600.0500 616.2594 683.5366 688.5048 704.2227 737.1945 738.0304 763.0481 836.3290 841.2889 860.0489 864.6751 869.0790 870.8284 896.3336 910.6462 924.9495 941.0757 984.6655 990.5391 992.0025 1001.1193 1029.0444 1051.5411 1056.9051 1074.5187 1087.7493 1094.9968 1102.4398 1108.4915 1127.3109 1137.4718 1174.3004 1190.1175 1212.7888 1219.9506 1220.1984 1280.3201 1282.2778 1292.1927 1295.5943 1314.1480 1324.3857 1349.5101 1362.1449 1362.9683 1388.6401 1393.1576 1394.8469 1437.7377 1439.2474 1443.0163 1472.9085 1473.8468 1479.1852 1479.7401 1485.4645 1485.7502 1486.6957 1595.8092 1617.2755 1644.7445 1665.8032 2974.1857 2975.1231 2983.2711 2983.4338 3002.6976 3003.5888 3034.0400 3038.3313 3051.5170 3053.1639 3055.2527 3076.8073 3078.4258 3079.5150 3079.6021 3126.5293 3135.0768 3146.8084 3161.0356 3172.8053
redmass: 2.9204 2.4605 3.2591 2.9149 2.5603 2.7839 4.7357 7.7997 3.0610 3.0570 4.3016 4.3908 4.5927 5.8675 1.0853 1.0792 6.2248 4.7452 4.9072 6.4715 3.5570 3.4915 2.8293 3.9525 3.2338 4.1787 4.1235 3.6146 5.7849 6.4381 6.3809 5.6865 1.8371 1.1901 1.1885 1.9078 3.7204 4.8896 1.2924 2.3816 1.5344 1.5102 2.5658 2.3534 3.2429 1.5699 1.4649 4.6968 5.6610 1.3292 2.1379 2.2549 2.3884 3.4515 1.6698 1.8699 1.6396 2.4526 2.2899 2.6312 1.0547 1.1165 1.9668 1.3347 1.3323 1.2001 1.1966 1.2716 1.3330 1.5748 1.1931 1.4579 1.7000 1.7437 6.2141 1.2135 1.2160 1.0852 1.0849 2.1589 1.0536 1.0517 1.0422 1.0422 1.0782 1.0797 2.3676 6.2262 6.0057 9.9481 10.4517 1.0359 1.0362 1.0632 1.0640 1.0615 1.0611 1.0961 1.0959 1.0860 1.0999 1.0990 1.0990 1.1002 1.1009 1.1015 1.0851 1.0891 1.0937 1.0975 1.0986
irintensity: 0.1084 0.0393 0.2956 0.0039 1.2268 1.3245 0.9236 0.1984 2.2675 2.3704 0.0756 1.1178 0.5352 1.0412 0.1079 0.1089 7.3238 10.8580 11.0851 8.6802 2.1387 0.4463 0.5556 0.5110 13.3145 1.4215 5.6541 4.9104 16.1557 1.3229 3.3860 8.0510 49.4620 8.7856 15.3133 113.0576 10.8186 187.6583 0.9883 14.0026 7.1683 13.4078 14.3985 76.8206 132.7103 7.5258 0.5696 69.0580 159.0801 0.1633 5.6781 41.9987 11.0560 199.5941 13.0537 68.3771 6.0971 83.7849 66.4598 219.5854 0.0272 1.1375 16.7569 1.0075 0.4815 23.6467 28.6319 44.9697 44.4845 10.1933 4.5648 25.8334 33.7082 14.0178 3.1169 8.0263 8.0625 24.9748 21.2098 10.3678 4.9630 4.4872 12.5992 13.1669 15.0812 16.5586 7.0809 4.1185 0.2696 103.5760 190.5270 37.0270 35.8563 7.2844 4.6059 22.2563 21.6422 1.6004 1.5494 7.5767 0.3248 0.8143 47.5256 54.7907 41.2852 94.4621 0.0621 4.9043 20.5026 26.9925 10.5166
temp: 298.150 k
press: 1.00000 atm
elementType: 8 8 8 8 6 6 6 6 6 6 6 6 6 6 6 6 6 6 6 1 1 1 1 1 1 1 1 1 1 1 1 1 1 1 1 1 1 1 1
symmnumber: 1
zpe: 837997.4 jmol-1
zpe.correction: 0.319176 hartree
zpe.thermalcorrener: 0.339979 hartree
zpe.thermalcorrenthalpy: 0.340923 hartree
zpe.thermalcorrgfe: 0.264209 hartree
zpe.sumelectzpe: -883.064434 hartree
zpe.sumelectthermal: -883.043631 hartree
zpe.sumelectthermalent: -883.042687 hartree
zpe.sumelectthermalfe: -883.119401 hartree
dipole: -0.9489 -1.0161 -2.4673
dipole: 2.8320
quadrupole: -100.6774 -103.9950 -115.9671
quadrupole: -1.0719 1.5301 -3.5366
quadrupole: 6.2024 2.8848 -9.0872 -1.0719 1.5301 -3.5366
hfenergy: -883.3836106 hartree
pointgroup: C01 [X(C15H20O4)]
dipole: 0.3111412 0.3160913 -1.0221238 debye
polarizability: 180.816673|-17.1264657|194.0011253|-20.7490204|-15.6703951|145.0549456 unknown
InChI: InChI=1S/C15H20O4/c1-3-8-13(16)18-15(19-14(17)9-4-2)12-10-6-5-7-11-12/h5-7,10-11,15H,3-4,8-9H2,1-2H3
charge 0 multiplicity 1
39 atoms
O  -0.623171 -0.603535 -0.353049
O  1.397317 0.582878 -0.287613
O  -1.701431 -1.109137 1.65931
O  2.039052 -1.243622 1.029506
C  0.071841 0.545989 0.319077
C  -0.644349 1.844531 0.042408
C  -1.903899 -2.63327 -0.284373
C  3.607037 -0.289715 -0.639486
C  -3.117142 -3.323694 0.372464
C  4.755583 -1.136964 -0.054951
C  -1.434035 -1.406208 0.474346
C  2.314484 -0.413292 0.141905
C  -1.639782 2.274768 0.954111
C  -0.365346 2.613633 -1.113275
C  -3.505556 -4.622816 -0.363481
C  6.031964 -1.042481 -0.91617
C  -2.354235 3.468131 0.709076
C  -1.079096 3.807573 -1.353305
C  -2.074817 4.237323 -0.444417
H  0.135637 0.300665 1.394634
H  -2.11652 -2.342692 -1.329761
H  -1.045871 -3.335224 -0.332225
H  3.881248 0.780792 -0.695664
H  3.393028 -0.59772 -1.683508
H  -3.974625 -2.624084 0.383105
H  -2.880897 -3.537505 1.430794
H  4.968819 -0.801412 0.97752
H  4.425731 -2.188976 0.026996
H  -1.859451 1.667545 1.840032
H  0.413129 2.279368 -1.805445
H  -2.672794 -5.351369 -0.353443
H  -3.767181 -4.425212 -1.42029
H  -4.378125 -5.103366 0.114622
H  6.393507 0.000714 -0.988163
H  5.849247 -1.406982 -1.944846
H  6.846502 -1.650981 -0.484034
H  -3.122881 3.797589 1.416594
H  -0.85919 4.404032 -2.245685
H  -2.626735 5.165126 -0.632713
