program: Gaussian 09
title: 000254048
version: EM64L-G09RevD.01
frameworkgroup: C1[X(C23H23N)]
method: RPBEPBE
basis: SDD
operation: Freq
keyword: #pfreq=noraman
keyword: PBEPBE/SDD
title: #p freq=noraman PBEPBE/SDD
converged: YES YES NO NO
title: Mulliken charges:
elementType: N C C C C C C C C C C C C C C C C C C C C C C C H H H H H H H H H H H H H H H H H H H H H H H
charge: -0.109785 0.269377 -0.485702 0.249425 0.306109 -0.498825 -0.370304 -0.397109 0.275603 0.249446 -0.250031 -0.259915 -0.636498 -0.622049 -0.389779 -0.405187 -0.414904 -0.405886 -0.233324 -0.237416 -0.238180 -0.233692 -0.247126 -0.249640 0.243777 0.203314 0.227937 0.279572 0.241405 0.225441 0.225970 0.249514 0.185949 0.219448 0.219698 0.186209 0.229526 0.256878 0.258777 0.250353 0.265522 0.226417 0.227461 0.225347 0.228935 0.229216 0.228728
chargesum: 0.00000
title: Mulliken charges with hydrogens summed into heavy atoms:
elementType: N C C C C C C C C C C C C C C C C C C C C C C C
charge: -0.109785 0.269377 -0.038611 0.249425 0.306109 -0.270888 -0.090732 -0.155704 0.275603 0.249446 -0.024590 -0.033945 0.018413 0.013384 -0.132901 -0.146410 -0.164551 -0.140365 -0.006908 -0.009955 -0.012833 -0.004757 -0.017910 -0.020912
polarizability: 3.32286187e+02 -7.78580503e+00 2.55875525e+02 -3.82807762e+01 3.47869211e+00 2.07106806e+02
1716.lowfreq: -6.6799 -0.0003 0.0002 0.0006 1.7675 11.2458 23.8894 40.6791 41.6998
frequency: 23.6605 40.6376 41.5724 53.3688 62.8566 68.0909 74.4695 81.2860 108.3676 133.8118 162.4447 212.5875 220.1822 230.5932 240.2179 253.4446 266.1959 289.2118 308.1764 331.7615 363.5971 393.8547 406.3151 410.7596 431.9931 446.7979 467.6039 495.4171 525.1615 552.0368 589.6491 607.6039 611.2673 616.0412 636.9161 655.7768 702.7195 704.3537 707.3331 734.6534 764.5384 772.1021 782.5055 792.2678 818.0510 848.3106 853.7936 859.7609 870.5885 886.6717 919.1278 930.1103 941.9929 959.6282 978.4600 980.5410 984.2740 988.2192 989.2632 995.1094 997.0838 1002.8655 1025.5753 1029.5229 1030.6516 1037.0052 1041.6549 1083.1762 1083.9054 1090.2649 1099.5178 1135.6431 1142.5368 1169.7579 1170.3582 1172.3257 1172.6187 1191.7265 1193.5627 1199.5593 1222.7834 1249.4806 1262.9618 1273.9425 1291.5104 1313.6370 1321.5654 1347.3987 1365.4584 1372.3817 1378.4676 1385.9452 1417.4567 1425.3912 1432.5004 1435.0473 1439.5648 1454.8317 1459.8148 1472.2229 1476.6877 1477.3957 1480.2827 1485.8326 1486.4208 1570.7497 1577.9389 1578.6445 1601.4969 1604.9299 1607.3884 1611.6246 2846.7206 2857.4761 2875.2873 3001.3322 3015.3234 3024.6668 3075.5733 3080.9974 3084.8322 3114.6683 3121.6943 3123.4865 3126.5592 3128.1305 3132.1432 3140.9227 3141.6066 3144.8355 3149.5175 3155.0362 3157.6382 3164.1815 3166.9634
redmass: 4.4861 3.9527 3.7006 3.9197 3.6195 3.9994 3.2102 4.0766 3.8220 3.7766 4.1711 3.4869 4.1642 1.2698 1.1561 3.8457 3.3075 3.9199 3.8185 3.1087 2.0222 3.2443 2.8987 2.8992 2.6871 3.8932 3.5965 3.2804 3.5274 5.6983 4.4443 5.7185 5.5467 6.4089 3.7378 5.7668 1.7104 1.9385 3.5522 2.3936 1.9097 1.5942 2.1796 3.6553 4.5290 2.7829 1.4379 1.2473 1.5586 1.4092 1.9093 1.4970 2.1737 1.6708 1.4130 1.5615 1.3831 5.5520 5.8068 1.3217 1.3104 1.3969 2.4365 2.2088 2.0590 1.6008 2.1548 1.6199 1.6210 1.2774 1.9557 1.4149 2.9070 1.0686 1.8890 1.0530 1.0538 1.1214 1.1185 2.0328 2.2261 1.9261 2.6710 2.1351 1.6188 1.4100 1.3576 2.2616 2.1086 4.0024 4.2706 2.7512 1.1414 1.9563 2.2250 2.0617 1.3260 1.1276 1.0656 1.2278 1.0683 1.8307 2.0611 1.9490 1.1808 6.7720 5.8681 5.7641 7.0901 6.0564 6.1644 6.5284 1.0570 1.0591 1.0670 1.0873 1.0719 1.0726 1.1011 1.0867 1.1007 1.0860 1.0845 1.0846 1.0883 1.0874 1.0879 1.0923 1.0934 1.0931 1.0960 1.0960 1.1006 1.1015 1.1007
irintensity: 0.0546 0.0161 0.0512 0.2011 0.0831 0.1847 0.8036 0.1310 1.8601 0.3068 0.0415 0.3342 0.1822 0.2723 0.4959 1.2166 1.4957 0.8279 0.8992 6.8285 2.3464 0.3783 0.0850 0.2698 3.6564 4.1495 0.7727 6.4696 4.4513 9.4663 8.4754 4.5799 3.0049 0.1220 7.5452 2.3145 71.9170 29.5390 2.0326 25.6251 35.7414 29.9094 61.8114 4.0977 18.6929 4.3643 0.9510 0.2949 20.2342 1.0639 4.5313 1.3168 4.4884 7.7626 0.7391 2.8844 0.9907 0.0590 0.6299 0.4134 0.7361 3.2612 3.4644 52.8476 13.1940 14.7873 14.9211 8.6783 7.2639 5.3143 2.4086 5.5293 0.6292 1.2137 3.2176 0.0276 0.0383 1.6864 0.1969 0.9208 3.4753 8.9938 6.7854 0.1856 6.0588 1.1076 0.7615 5.1256 3.9679 2.8747 3.1945 7.1590 4.2986 5.9485 9.1657 14.2737 10.3043 10.1099 13.1356 18.6610 13.9602 13.3821 8.5816 16.9045 14.6287 0.4120 0.7295 1.7307 3.5550 1.4008 1.9760 4.9385 58.5875 120.2279 91.8326 10.7616 41.2179 42.8439 29.7917 22.5267 40.2713 4.8914 4.3216 1.3481 8.8965 0.8548 3.3519 20.4660 12.5765 25.4417 32.4858 30.3273 47.5994 28.8481 15.2540
temp: 298.150 k
press: 1.00000 atm
elementType: 7 6 6 6 6 6 6 6 6 6 6 6 6 6 6 6 6 6 6 6 6 6 6 6 1 1 1 1 1 1 1 1 1 1 1 1 1 1 1 1 1 1 1 1 1 1 1
symmnumber: 1
zpe: 1022560.5 jmol-1
zpe.correction: 0.389473 hartree
zpe.thermalcorrener: 0.411058 hartree
zpe.thermalcorrenthalpy: 0.412002 hartree
zpe.thermalcorrgfe: 0.337673 hartree
zpe.sumelectzpe: -943.278032 hartree
zpe.sumelectthermal: -943.256446 hartree
zpe.sumelectthermalent: -943.255502 hartree
zpe.sumelectthermalfe: -943.329831 hartree
dipole: -0.7520 0.5641 0.7145
dipole: 1.1808
quadrupole: -136.2404 -132.7173 -136.1505
quadrupole: 0.6734 -3.2230 -0.5827
quadrupole: -1.2043 2.3188 -1.1144 0.6734 -3.2230 -0.5827
hfenergy: -943.6675047 hartree
pointgroup: C01 [X(C23H23N1)]
dipole: -0.2814251 0.1314552 -0.3454397 debye
polarizability: 328.6146991|-32.6070745|219.4317078|29.9435099|18.4331489|247.2221101 unknown
InChI: InChI=1S/C23H23N/c1-24(2)18-22-16-10-9-15-21(22)17-23(19-11-5-3-6-12-19)20-13-7-4-8-14-20/h3-17H,18H2,1-2H3
charge 0 multiplicity 1
47 atoms
N  3.032597 1.567496 -1.349371
C  2.236841 0.278511 0.652391
C  1.921393 0.786413 -0.753434
C  1.231861 0.124946 1.662575
C  -1.091236 0.054278 0.490809
C  -0.210673 0.431298 1.484033
C  3.582848 -0.035658 0.969511
C  1.638438 -0.28169 2.969584
C  -2.477419 0.621635 0.504904
C  -0.76176 -0.947884 -0.570653
C  3.959067 -0.479881 2.253727
C  2.978056 -0.594631 3.267408
C  3.204291 2.888631 -0.711986
C  2.919176 1.669457 -2.81701
C  -3.602582 -0.173743 0.146499
C  -1.190884 -0.752095 -1.913489
C  -2.708738 1.970728 0.897857
C  -0.032114 -2.129383 -0.263219
C  -4.910479 0.352808 0.201771
C  -0.88199 -1.693026 -2.919312
C  -4.016516 2.498068 0.953121
C  0.273208 -3.073411 -1.266762
C  -5.125493 1.69094 0.607749
C  -0.145565 -2.858484 -2.601141
H  1.735495 -0.080868 -1.416972
H  0.968295 1.370376 -0.735439
H  -0.641352 1.018921 2.308957
H  4.327754 0.110339 0.179316
H  0.874056 -0.368083 3.751891
H  5.007122 -0.718574 2.467983
H  3.255724 -0.918881 4.276655
H  3.351598 2.762254 0.374184
H  2.32463 3.56473 -0.866897
H  4.098983 3.38838 -1.124876
H  3.807197 2.188624 -3.221161
H  2.011105 2.230641 -3.157102
H  2.87966 0.658352 -3.260259
H  -3.447604 -1.213734 -0.160757
H  -1.762762 0.147486 -2.166944
H  -1.85254 2.612783 1.134516
H  0.286696 -2.308042 0.76846
H  -5.762505 -0.281736 -0.067416
H  -1.215209 -1.518026 -3.94856
H  -4.170163 3.541392 1.251597
H  0.833533 -3.978547 -1.006838
H  -6.140945 2.100907 0.646014
H  0.092105 -3.592117 -3.379713
