program: Gaussian 09
title: 000254008
version: EM64L-G09RevD.01
frameworkgroup: C1[X(C11H12N2O)]
method: RPBEPBE
basis: SDD
operation: Freq
keyword: #p
keyword: freq=noraman
keyword: PBEPBE/SDD
title: #p freq=noraman PBEPBE/SDD
converged: YES YES NO NO
title: Mulliken charges:
elementType: O N N C C C C C C C C C C C H H H H H H H H H H H H
charge: -0.229497 -0.402224 0.055279 -0.351375 -0.465782 -0.464775 0.301795 -0.378214 0.441308 -0.381982 -0.363580 -0.224470 -0.219303 -0.233937 0.223643 0.269097 0.242911 0.242714 0.269794 0.275913 0.201185 0.221257 0.281971 0.227757 0.230179 0.230337
chargesum: 0.00000
title: Mulliken charges with hydrogens summed into heavy atoms:
elementType: O N N C C C C C C C C C C C
charge: -0.229497 -0.126312 0.055279 -0.127732 0.046226 0.047733 0.301795 -0.177029 0.441308 -0.160725 -0.081609 0.003287 0.010876 -0.003600
polarizability: 2.81218637e+02 -3.22955531e+00 1.29461631e+02 2.55794119e-01 3.90392071e-03 6.85552650e+01
1716.lowfreq: -5.5316 -0.0002 0.0002 0.0004 5.4886 13.4261 40.1901 44.6866 55.2807
frequency: 40.1416 44.6852 55.2777 74.0373 148.8555 167.4013 219.4394 240.6925 263.3119 266.1091 335.0583 400.3283 404.8484 480.8246 514.4003 614.2124 620.3089 635.0273 660.5437 698.6111 702.3563 771.9406 786.5370 803.1189 831.0722 855.6460 871.7647 883.0198 919.0374 949.9205 958.2709 984.8080 987.5894 1006.3061 1022.9475 1044.2953 1054.3203 1078.7282 1086.8521 1087.1959 1088.2245 1157.4266 1173.1450 1176.6891 1184.7923 1209.1964 1239.6878 1315.3630 1342.2363 1377.1751 1390.2424 1423.4004 1438.0029 1448.1009 1480.1501 1504.6796 1569.9306 1596.0110 1612.7312 1639.1330 2954.6106 3102.5596 3106.9252 3114.9573 3119.6355 3130.2028 3143.0923 3157.9214 3169.0155 3208.6801 3226.7218 3366.8614
redmass: 4.7467 3.4289 5.0918 3.8528 4.9309 4.7176 2.9378 5.4785 5.1215 3.0367 4.1489 6.0207 2.8349 6.5666 2.9205 6.4394 1.2292 6.0585 2.9544 2.1327 3.3705 1.7499 1.1217 2.0525 3.6188 1.2529 4.6134 2.0222 1.3749 1.5794 4.2028 1.3699 6.2679 1.3360 2.1843 2.5400 1.5795 1.0953 1.6160 1.3764 1.4792 2.6343 1.0582 1.3605 1.1131 2.2073 1.8957 1.5398 1.4025 1.9861 5.2464 1.0870 2.2992 1.3552 2.0985 1.9901 6.2084 5.7437 6.0317 6.9428 1.0864 1.0502 1.0638 1.0875 1.0885 1.0868 1.0921 1.0961 1.1005 1.1181 1.1162 1.0751
irintensity: 1.6831 3.3401 2.8932 0.8201 0.8472 1.9710 23.4187 2.8769 10.9223 2.0050 2.5290 1.5517 0.0937 0.5492 7.9232 0.1289 80.7531 14.1956 4.2222 29.7899 26.8284 43.7959 4.9863 9.5538 3.1673 0.6651 12.8708 7.3934 4.7239 35.5836 105.9168 0.0300 0.9693 1.4957 10.0902 20.2323 1.2669 14.4868 4.5538 2.9565 7.0399 569.0788 1.2645 0.2545 1.6952 0.7236 43.0860 10.2328 7.2924 114.9073 17.0148 12.2968 8.2978 9.5577 84.5817 258.6333 3.2425 1.4824 0.5561 153.6398 63.6146 15.3929 14.8637 10.0910 14.7596 0.2413 26.5028 23.7834 22.4181 0.4884 11.5437 14.2385
temp: 298.150 k
press: 1.00000 atm
elementType: 8 7 7 6 6 6 6 6 6 6 6 6 6 6 1 1 1 1 1 1 1 1 1 1 1 1
symmnumber: 1
zpe: 542729.8 jmol-1
zpe.correction: 0.206715 hartree
zpe.thermalcorrener: 0.219456 hartree
zpe.thermalcorrenthalpy: 0.220400 hartree
zpe.thermalcorrgfe: 0.166017 hartree
zpe.sumelectzpe: -610.029711 hartree
zpe.sumelectthermal: -610.016970 hartree
zpe.sumelectthermalent: -610.016026 hartree
zpe.sumelectthermalfe: -610.070409 hartree
dipole: 0.1341 -4.8318 -0.0178
dipole: 4.8337
quadrupole: -64.7531 -76.2045 -86.1439
quadrupole: 9.9489 0.1170 0.0248
quadrupole: 10.9474 -0.5040 -10.4434 9.9489 0.1170 0.0248
hfenergy: -610.2364257 hartree
pointgroup: C01 [X(C11H12N2O1)]
dipole: -0.0471743 -1.6336484 0.9724017 debye
dipolederiv: -0.7489666 0.0286614 0.0084166 -0.4806462 -0.7436465 0.2678515 0.3130668 0.239851 -0.5043105 -2.1852756 -0.3579097 0.3293331 0.0300162 -0.154669 -0.0898334 0.100789 -0.0659259 -0.2749179 0.8583533 0.0707716 -0.097492 -0.6021371 -0.2283522 0.1225542 0.2998606 0.0810025 -0.1508962 -1.0635198 0.0510318 0.0458883 -0.0611144 0.0026018 0.0127167 0.1249326 0.0047903 0.0089653 0.2497047 -0.0525659 0.0267698 0.2827522 0.0530826 -0.0701409 0.1391133 -0.0314974 -0.0996096 0.2058367 -0.0747185 0.0053087 -0.0267576 -0.024476 -0.0716273 -0.3479484 -0.0827405 0.0148278 2.537058 0.1596704 -0.2448769 0.7949077 0.8420442 -0.4218136 -0.6233231 -0.3867922 0.4814087 0.1939176 -0.0695127 0.0243078 -0.3563013 0.3063306 -0.2258455 0.1985097 -0.2416885 0.0221828 0.1239845 0.0014714 -0.0067623 0.0123002 -0.0628468 0.0513664 -0.0159711 0.0520603 -0.0047523 -0.0931033 -0.0656395 0.0338628 0.0438027 0.0159533 -0.1213145 -0.0308025 -0.1146531 -0.1170586 -0.0862887 0.0642379 -0.0391745 0.0268702 -0.0652274 -0.0402996 -0.017361 -0.0430296 -0.105935 0.0706312 0.0933972 -0.0665085 0.1790904 -0.0497518 -0.0681965 -0.1159067 -0.0630878 -0.1053098 -0.1121202 -0.0519504 0.0287487 -0.1115535 0.0812183 -0.1275606 0.0631218 -0.1313343 -0.0744964 -0.0202 -0.0384524 0.0157574 -0.0073199 -0.060215 -0.060069 -0.0034144 -0.0580199 -0.128539 -0.0326825 -0.0409188 0.0366625 -0.0131527 -0.0566114 0.1121396 0.0182548 0.1132451 0.0507559 0.0981137 0.0465286 -0.0293358 0.0032429 0.0678789 0.0642804 0.0067086 0.0225277 -0.0295657 -0.0356135 0.1068534 0.0413001 0.0903519 -0.0243859 -0.0402601 0.0535089 -0.0156683 0.0610393 -0.058048 0.0182427 -0.1096801 0.0032351 0.066244 0.0367509 -0.1015794 0.0100909 -0.0063844 0.0992589 0.0384948 -0.0317503 -0.0183706 -0.0450372 -0.0299498 -0.0062076 0.0044899 0.0879005 0.0092967 0.0099318 0.0127004 0.1170662 0.058479 0.1457261 -0.053403 0.15109 0.2280324 -0.0225499 0.0479612 -0.0169427 0.079586 -0.101345 0.161706 -0.0351585 0.1631501 0.0850025 0.0867497 0.0667906 -0.0355265 0.0329345 -0.0446419 0.1169118 -0.0157515 0.1149889 0.0914536 0.0532142 -0.0662932 0.0440586 -0.0522124 0.0818609 0.0463982 0.036032 0.0474039 0.1263756 -0.0650945 -0.0834312 0.0612067 -0.104323 0.0408494 0.075594 0.0732 0.074415 0.1125686 0.0587759 0.0353701 -0.0153562 0.0695091 -0.045304 0.1138317 -0.035602 0.1158696 0.0900279 -0.1214323 0.0619774 -0.0209158 0.0682235 0.0899671 0.0390834 -0.0246687 0.0394623 0.1412345 unknown
polarizability: 280.6347604|-2.4219007|113.7832409|-11.2826399|-26.4784383|84.8175311 unknown
InChI: InChI=1S/C11H12N2O/c14-11(10-6-7-10)13-12-8-9-4-2-1-3-5-9/h1-5,8,10,13H,6-7H2
charge 0 multiplicity 1
26 atoms
O  2.626492 1.097493 -0.979608
N  1.514552 -0.648852 0.141452
N  0.250768 -0.141185 -0.085021
C  3.94114 -0.693916 0.014009
C  5.090796 -0.613055 -1.020562
C  5.187605 0.187209 0.268771
C  2.664604 0.018308 -0.331997
C  -0.771912 -0.827823 0.381248
C  -2.151124 -0.363678 0.185634
C  -3.225704 -1.141144 0.699089
C  -2.440479 0.847044 -0.508009
C  -4.561869 -0.721474 0.524575
C  -3.774685 1.261461 -0.679235
C  -4.841315 0.480964 -0.165008
H  3.859161 -1.620149 0.593926
H  4.862824 -0.059734 -1.935513
H  5.716198 -1.501349 -1.143795
H  5.882337 -0.139516 1.047219
H  5.021711 1.26562 0.199728
H  1.638822 -1.532674 0.660501
H  -0.64279 -1.780956 0.93738
H  -3.011727 -2.075236 1.234537
H  -1.606099 1.43779 -0.899503
H  -5.381818 -1.328503 0.924053
H  -3.989791 2.193538 -1.213628
H  -5.877995 0.808414 -0.301344
