program: Gaussian 09
title: 000254075
version: EM64L-G09RevD.01
frameworkgroup: C1[X(C24H28O4)]
method: RPBEPBE
basis: SDD
operation: Freq
keyword: #pfreq=noraman
keyword: PBEPBE/SDD
title: #p freq=noraman PBEPBE/SDD
converged: YES YES NO NO
title: Mulliken charges:
elementType: O O O O C C C C C C C C C C C C C C C C C C C C C C C C H H H H H H H H H H H H H H H H H H H H H H H H H H H H
charge: -0.278634 -0.283978 -0.265938 -0.227465 0.156647 0.072020 0.279392 -0.577327 0.209502 0.194789 -0.725133 -0.726421 0.281784 -0.363403 -0.389140 -0.346878 -0.595025 -0.399177 -0.378728 -0.378308 0.366776 -0.700093 -0.361561 -0.366186 0.314017 0.264213 -0.538017 -0.758987 0.198885 0.239164 0.234576 0.240739 0.224024 0.230637 0.221070 0.236775 0.205007 0.220829 0.240454 0.190950 0.202132 0.278104 0.235080 0.244234 0.299353 0.215962 0.213058 0.211254 0.240070 0.252485 0.220978 0.220800 0.246722 0.249738 0.248987 0.259195
chargesum: 0.00000
title: Mulliken charges with hydrogens summed into heavy atoms:
elementType: O O O O C C C C C C C C C C C C C C C C C C C C C C C C
charge: -0.278634 -0.283978 -0.265938 -0.227465 0.156647 0.072020 0.279392 -0.139279 0.209502 0.194789 -0.025794 -0.037939 0.281784 0.062434 -0.148686 0.046203 -0.316921 -0.164098 -0.134494 -0.078955 0.366776 -0.059820 -0.121491 -0.113701 0.314017 0.264213 0.150484 -0.001068
polarizability: 4.59516923e+02 1.39937774e+01 2.44883454e+02 9.64021329e-01 -6.70747336e+00 1.92700528e+02
1716.lowfreq: -53.1617 -2.2356 -0.0006 -0.0001 0.0008 5.1657 8.2158 18.9365 26.3164
frequency: -53.1571 18.8025 26.2886 29.5824 34.9136 37.9574 47.7837 69.8504 71.6707 83.5698 95.4191 115.5358 125.0520 137.7213 155.5925 168.5523 175.9047 204.6727 217.8631 219.9997 229.5125 233.7414 241.9282 247.6948 256.9350 275.9231 283.7989 298.3243 320.7268 349.9295 370.2030 379.1304 389.2605 412.8154 421.5439 450.0467 455.0746 470.1519 492.1897 505.0500 513.6970 555.3916 563.0551 569.5406 592.9568 616.8534 628.0925 649.5165 660.3918 694.0791 712.8161 731.5773 735.8695 737.5967 755.1063 775.2031 792.4336 809.3250 819.2510 836.9365 842.1466 851.4591 880.1125 895.4913 903.5858 922.5970 926.8597 939.9178 963.2961 966.7099 969.9334 978.7402 988.8261 995.8480 1000.0904 1001.2012 1010.1152 1044.5913 1051.2758 1069.6994 1096.9825 1105.3197 1109.0842 1113.6069 1121.0412 1134.6545 1153.2776 1156.7523 1175.4232 1179.4915 1187.1729 1207.2935 1224.2429 1228.3608 1237.7558 1257.5041 1262.2292 1274.2823 1280.8339 1289.3246 1296.8965 1321.7661 1328.4342 1348.7733 1350.8717 1372.5508 1380.5234 1383.6872 1389.6883 1392.8746 1411.6639 1418.6819 1437.1062 1453.2786 1454.0456 1458.3103 1458.6290 1467.8476 1468.3963 1470.5042 1472.9133 1473.5020 1476.7134 1479.1890 1481.8077 1487.3351 1494.0382 1496.6657 1561.6518 1569.0634 1614.0982 1615.8857 1627.7558 1647.7571 2959.0616 2963.7375 2969.3777 2972.9831 2982.6538 2985.5713 3001.3853 3005.5242 3008.0668 3032.4322 3046.5015 3056.6261 3070.3963 3071.6047 3085.7779 3091.1631 3094.8507 3102.3383 3109.3168 3125.3924 3131.4443 3134.7590 3143.6225 3146.7675 3161.6771 3166.6582 3182.5627 3217.6684
redmass: 1.0591 5.6521 4.7329 4.4096 3.7501 4.3473 3.9039 3.0044 1.8573 3.4300 3.7155 3.6041 4.3880 2.9663 3.5456 5.4344 3.3537 1.4658 2.5806 2.2229 1.1410 2.6692 3.5271 1.4262 1.1625 3.5041 3.0814 3.2856 3.9201 3.9408 3.5040 4.8263 3.3032 2.9853 4.0719 3.6260 3.9681 3.6415 4.2160 3.3093 4.2722 4.2150 3.3658 3.2915 5.7864 5.8584 5.4536 5.5653 4.9791 5.0445 3.6675 1.4310 4.9445 2.5802 3.8606 2.3681 3.6187 1.5719 1.3934 1.4561 1.6763 6.1408 1.5543 2.0912 2.4311 1.5771 1.4221 1.3618 1.3298 1.3907 3.4367 2.3920 7.2027 1.6294 1.8275 2.5152 2.4978 1.6005 3.5832 2.5857 1.9371 1.9491 1.4578 1.2608 1.6542 2.0043 1.8838 1.3427 3.5592 1.3221 2.8734 1.6367 2.0653 3.0028 3.6741 1.3135 2.4223 1.5627 1.6844 1.0858 1.2957 2.8273 1.4906 5.1924 1.5461 1.2192 5.4664 1.3061 1.2141 1.2422 3.7546 4.0634 1.1729 1.0536 1.0626 1.0524 1.0463 1.0499 1.0654 1.0677 1.1392 1.0956 1.0518 1.2522 1.1624 1.2983 1.3066 2.4039 8.6870 7.1928 6.8075 7.2991 8.7567 11.0038 1.0330 1.0586 1.0639 1.0372 1.0605 1.0345 1.0355 1.0989 1.0367 1.0986 1.1039 1.0988 1.1007 1.0993 1.0995 1.1005 1.0972 1.1003 1.0997 1.0990 1.0888 1.0888 1.1009 1.0900 1.0941 1.0960 1.0925 1.0942
irintensity: 1.3116 0.2484 1.0075 2.1817 0.5503 0.1146 0.5590 2.1504 0.4223 0.5999 2.4695 3.6555 0.7014 1.9364 0.1914 0.9812 0.9874 0.3261 3.9063 1.5215 0.0128 0.1655 2.0962 0.3963 0.9500 1.4843 1.0126 0.0927 3.5037 1.7886 1.8116 1.1424 0.4973 0.2296 3.2653 2.1332 3.2886 5.4181 0.7041 6.2356 4.6854 29.9885 2.3233 19.7908 1.9869 1.8375 1.0722 0.3518 11.3977 4.3482 9.7500 6.2310 5.5402 3.0636 5.0380 3.2079 11.2456 17.5274 5.7487 30.5154 45.8660 1.4214 48.5327 3.5303 6.9405 10.6048 8.1614 0.4032 1.0148 3.7254 114.6028 12.0825 26.5865 1.2201 126.5827 7.0615 7.6830 9.3189 11.8174 2.5992 149.7553 14.2245 13.2439 0.3261 96.0766 53.3222 25.8881 8.3227 826.8854 21.4558 19.6173 3.0601 1.5419 190.1042 44.7919 3.3788 23.5059 1.3785 1.0286 0.3070 1.1908 42.8383 0.8543 11.2934 2.1316 31.3228 44.3907 87.0591 12.7090 19.8238 5.9655 14.1835 10.5591 1.7775 13.8476 1.2824 18.0361 13.9590 0.4696 10.6887 4.5227 72.0290 6.7391 15.4905 35.3827 37.1412 24.6154 149.8914 35.2253 11.2132 22.3110 86.2730 24.4159 255.5723 75.4282 23.2431 7.4129 33.4098 59.9051 16.7493 18.0051 1.8734 5.6723 9.0997 47.4280 26.7364 83.9331 56.5817 13.5198 22.9005 6.4360 32.6207 21.5305 31.7990 6.9831 12.0615 7.6721 12.8852 16.6948 4.9913 0.4027 3.8137
temp: 298.150 k
press: 1.00000 atm
elementType: 8 8 8 8 6 6 6 6 6 6 6 6 6 6 6 6 6 6 6 6 6 6 6 6 6 6 6 6 1 1 1 1 1 1 1 1 1 1 1 1 1 1 1 1 1 1 1 1 1 1 1 1 1 1 1 1
symmnumber: 1
zpe: 1204940.7 jmol-1
zpe.correction: 0.458938 hartree
zpe.thermalcorrener: 0.486909 hartree
zpe.thermalcorrenthalpy: 0.487853 hartree
zpe.thermalcorrgfe: 0.398619 hartree
zpe.sumelectzpe: -1230.175343 hartree
zpe.sumelectthermal: -1230.147372 hartree
zpe.sumelectthermalent: -1230.146428 hartree
zpe.sumelectthermalfe: -1230.235662 hartree
dipole: -2.9506 -1.6037 -1.3726
dipole: 3.6280
quadrupole: -140.7937 -164.2956 -165.0344
quadrupole: -3.7299 17.1781 4.0518
quadrupole: 15.9142 -7.5877 -8.3264 -3.7299 17.1781 4.0518
hfenergy: -1230.634281 hartree
pointgroup: C01 [X(C24H28O4)]
dipole: -1.1243945 -0.7106811 -0.5176834 debye
polarizability: 456.6523565|28.1171896|247.6357399|-2.9865387|-7.4191628|192.812809 unknown
InChI: InChI=1S/C24H28O4/c1-6-7-8-21-20-14-13-19(27-16(2)25)15-22(20)28-24(3,4)23(21)17-9-11-18(26-5)12-10-17/h9-15H,6-8H2,1-5H3
charge 0 multiplicity 1
56 atoms
O  1.035568 -1.856952 0.994953
O  5.47506 -0.318745 0.256551
O  -6.713419 -0.391056 0.457138
O  6.436946 1.524413 -0.857528
C  -0.328819 -2.065555 0.373499
C  -0.98104 -0.703035 0.054578
C  -0.197332 0.368392 -0.312112
C  -0.794545 1.711262 -0.707265
C  1.276454 0.228092 -0.285455
C  1.847002 -0.886338 0.401374
C  -0.123149 -2.899548 -0.914348
C  -1.074834 -2.867125 1.450778
C  -2.477775 -0.626255 0.116035
C  -0.629003 2.814744 0.374533
C  2.176861 1.177539 -0.832119
C  -1.149682 4.189885 -0.100388
C  3.236355 -1.019942 0.567969
C  -3.293064 -1.139898 -0.923587
C  -3.128658 -0.045513 1.241909
C  3.577716 1.063043 -0.704862
C  4.090816 -0.043905 0.01377
C  -1.008845 5.286134 0.977514
C  -4.704739 -1.082957 -0.858904
C  -4.530811 0.018132 1.325749
C  -5.32628 -0.503327 0.274544
C  6.551221 0.476048 -0.188681
C  -7.579806 -0.916418 -0.600463
C  7.856712 -0.137028 0.271905
H  -0.323802 2.066456 -1.647011
H  -1.869742 1.587366 -0.926594
H  0.396533 -3.844038 -0.673236
H  0.476981 -2.339844 -1.652933
H  -1.097977 -3.144891 -1.37207
H  -0.498764 -3.776525 1.693377
H  -2.076456 -3.160744 1.095553
H  -1.190565 -2.270321 2.370958
H  -1.177201 2.508487 1.287888
H  0.436685 2.902554 0.663984
H  1.780231 2.042476 -1.373444
H  -0.596339 4.493513 -1.013075
H  -2.213797 4.095057 -0.398453
H  3.647813 -1.873288 1.112026
H  -2.820978 -1.57224 -1.813299
H  -2.521646 0.356175 2.06101
H  4.245192 1.806565 -1.138251
H  -1.38568 6.26077 0.616496
H  0.049527 5.419824 1.270775
H  -1.577208 5.020403 1.888797
H  -5.296863 -1.481829 -1.688195
H  -5.031227 0.464075 2.190763
H  -7.42879 -2.004501 -0.741985
H  -7.409324 -0.390383 -1.560111
H  -8.605537 -0.727215 -0.25175
H  8.389389 0.585083 0.915328
H  8.498201 -0.327758 -0.605922
H  7.690632 -1.072514 0.823689
