program: Gaussian 09
title: 000254020
version: EM64L-G09RevD.01
frameworkgroup: C1[X(C9H14N4O3S)]
method: RPBEPBE
basis: SDD
operation: Freq
keyword: #p
keyword: freq=noraman
keyword: PBEPBE/SDD
title: #p freq=noraman PBEPBE/SDD
converged: YES YES NO NO
title: Mulliken charges:
elementType: S O O O N N N N C C C C C C C C C H H H H H H H H H H H H H H
charge: 0.148737 -0.214517 -0.211586 -0.221340 -0.371234 -0.377231 -0.600422 -0.328654 0.111177 -0.370117 -0.411787 0.146990 0.166761 -0.761966 -0.706098 0.153525 -0.064997 0.234875 0.265283 0.252937 0.214425 0.286888 0.331514 0.231954 0.258490 0.217412 0.366601 0.366485 0.320867 0.329774 0.235253
chargesum: 0.00000
title: Mulliken charges with hydrogens summed into heavy atoms:
elementType: S O O O N N N N C C C C C C C C C
charge: 0.148737 -0.214517 -0.211586 -0.221340 -0.004633 -0.010745 0.050219 -0.093401 0.111177 0.130041 0.055575 0.146990 0.166761 -0.143564 0.001758 0.153525 -0.064997
polarizability: 1.76549132e+02 2.04804607e+01 1.40034340e+02 -1.06731126e+01 1.35701919e+01 1.38457339e+02
1716.lowfreq: -16.0855 -5.8202 -0.0011 0.0003 0.0014 3.8846 15.1962 21.6520 28.1960
frequency: 15.0904 21.4178 27.9582 55.5664 73.4485 81.7384 117.6340 132.1150 154.9264 176.0542 176.5182 239.1955 245.7133 258.8257 287.6767 314.0994 350.3044 360.2869 361.8597 383.7322 416.9386 424.0740 461.5570 478.0619 485.2968 555.9385 574.8738 588.9102 631.4854 658.5007 670.7372 691.5723 701.9043 713.4886 748.8889 760.2781 769.5321 783.2862 789.5182 901.2905 928.6937 968.0468 989.2538 1006.1983 1031.3618 1044.4463 1049.9544 1080.4034 1110.5143 1143.4830 1188.4185 1227.9445 1264.1578 1276.1703 1284.6760 1304.2476 1313.1271 1331.5097 1341.2460 1366.8052 1375.9340 1376.9203 1399.4898 1439.7016 1451.5667 1467.1896 1472.5111 1490.4599 1612.1376 1614.8760 1648.2031 1657.0254 1677.8117 2971.9906 2978.9463 2994.2729 3026.2894 3043.6449 3082.4645 3084.1403 3103.2774 3105.6498 3397.0821 3518.7651 3520.5667 3525.8897 3674.3412
redmass: 6.7660 6.7821 5.2624 5.0506 4.1507 3.0115 2.6770 5.3858 8.7259 3.0500 3.6842 1.6510 2.3926 3.9380 3.1637 3.4085 5.8411 2.6544 1.4761 6.7898 1.4626 2.9978 7.0977 6.3934 5.9418 2.9665 2.6830 8.2087 4.0809 2.4789 2.4065 5.7217 7.0811 1.4880 1.5539 2.1880 2.1820 1.2730 1.6823 1.9716 3.5119 1.6631 3.4755 2.3788 1.8694 1.8724 2.4120 4.1479 2.2172 2.3765 2.1200 1.6869 1.3851 2.0793 1.5909 1.9731 1.2399 1.3554 1.4810 8.7533 1.8765 1.6223 1.2018 1.0894 1.0864 1.0820 1.0463 1.0519 3.6874 1.3916 7.9396 5.4165 5.4708 1.0657 1.0605 1.0370 1.0597 1.1008 1.0994 1.0988 1.1009 1.1029 1.0778 1.0758 1.0780 1.0448 1.1043
irintensity: 2.0126 0.4939 4.5983 5.7335 0.1181 2.4927 3.4919 0.4215 7.8715 2.2562 2.6970 2.9601 8.0287 6.8850 3.9243 5.0392 14.1510 13.7313 24.6687 2.1541 231.0370 55.3305 0.3542 26.9693 20.7988 25.2746 67.4327 3.5253 4.8762 0.9785 26.2458 9.6584 1.8639 88.1144 3.3396 4.2991 7.7603 13.0293 227.1547 9.4569 5.9582 113.5995 0.2467 3.2029 20.4678 6.5514 1.4938 3.9415 11.8193 17.9467 14.4144 43.0378 85.4728 136.1428 75.5833 223.6431 27.4718 14.6257 46.5415 221.9771 4.0193 2.7286 21.1140 12.5847 25.3158 6.1603 10.3281 10.3727 150.4135 220.4879 162.6614 183.5933 619.9190 34.3139 23.4027 23.4693 10.0749 6.5245 11.8087 23.3606 20.0268 4.3964 15.4576 84.8018 44.6640 36.5814 23.9980
temp: 298.150 k
press: 1.00000 atm
elementType: 16 8 8 8 7 7 7 7 6 6 6 6 6 6 6 6 6 1 1 1 1 1 1 1 1 1 1 1 1 1 1
symmnumber: 1
zpe: 625659.5 jmol-1
zpe.correction: 0.238301 hartree
zpe.thermalcorrener: 0.256681 hartree
zpe.thermalcorrenthalpy: 0.257625 hartree
zpe.thermalcorrgfe: 0.189129 hartree
zpe.sumelectzpe: -1192.843268 hartree
zpe.sumelectthermal: -1192.824889 hartree
zpe.sumelectthermalent: -1192.823944 hartree
zpe.sumelectthermalfe: -1192.892440 hartree
dipole: 2.7643 1.5369 -1.9446
dipole: 3.7128
quadrupole: -86.2688 -111.4942 -114.6089
quadrupole: -8.0901 -6.9529 -0.0052
quadrupole: 17.8551 -7.3703 -10.4849 -8.0901 -6.9529 -0.0052
hfenergy: -1193.0815694 hartree
pointgroup: C01 [X(C9H14N4O3S1)]
dipole: -1.0090676 0.8657833 0.6049331 debye
polarizability: 172.398471|-25.9526562|137.0877366|-6.5734929|-11.1971264|145.5546024 unknown
InChI: InChI=1S/C9H14N4O3S/c1-2-9(3-4-17-7(10)11)5(14)12-8(16)13-6(9)15/h10,12-13H,2-4,11H2,1H3
charge 0 multiplicity 1
31 atoms
S  -3.22189 0.059678 -1.275141
O  1.394993 0.026769 -2.69786
O  0.400263 0.5630 2.033179
O  3.299766 -2.731997 0.518304
N  2.337071 -1.302285 -1.061905
N  1.880108 -1.017325 1.236227
N  -5.200398 0.162559 0.542598
N  -3.183404 -1.00383 1.260639
C  0.911304 0.659406 -0.373295
C  -0.584428 0.948447 -0.723342
C  1.755095 2.007185 -0.41025
C  1.536332 -0.220688 -1.47186
C  1.009586 0.077353 1.046282
C  -1.406665 -0.332524 -0.949784
C  1.217022 3.157492 0.462072
C  2.561506 -1.751721 0.252442
C  -3.90711 -0.331514 0.415679
H  -0.606178 1.579288 -1.629939
H  -1.022317 1.516777 0.113884
H  1.780951 2.317149 -1.47195
H  2.79846 1.774301 -0.115777
H  -1.063169 -0.903408 -1.827213
H  -1.444173 -0.976378 -0.04885
H  0.231811 3.509555 0.111342
H  1.11544 2.862132 1.519566
H  1.91638 4.011673 0.404852
H  2.797369 -1.845195 -1.800164
H  1.986436 -1.358177 2.197516
H  -5.762433 -0.068987 1.359224
H  -5.605115 0.762856 -0.174161
H  -3.587611 -1.163991 2.199688
