program: Gaussian 09
title: 000250130
version: EM64L-G09RevD.01
frameworkgroup: C1[X(C15H16O3)]
method: RPBEPBE
basis: SDD
operation: Freq
keyword: #pfreq=noraman
keyword: PBEPBE/SDD
title: #p freq=noraman PBEPBE/SDD
converged: YES YES NO NO
title: Mulliken charges:
elementType: O O O C C C C C C C C C C C C C C C H H H H H H H H H H H H H H H H
charge: -0.293189 -0.386367 -0.215258 -0.351676 -0.347666 0.411654 -0.291377 0.453877 0.136539 -0.528339 0.159326 -0.627820 0.167493 -0.689148 -0.421771 -0.419193 -0.247350 -0.234903 0.202111 0.232582 0.202683 0.190813 0.225713 0.215030 0.284125 0.226632 0.216327 0.210306 0.216616 0.246567 0.239587 0.231021 0.229214 0.355844
chargesum: 0.00000
title: Mulliken charges with hydrogens summed into heavy atoms:
elementType: O O O C C C C C C C C C C C C C C C
charge: -0.293189 -0.030523 -0.215258 0.083016 0.045830 0.411654 0.149366 0.453877 0.136539 -0.244215 0.159326 -0.401189 0.167493 -0.045899 -0.175204 -0.179606 -0.016330 -0.005689
polarizability: 2.76298130e+02 2.60610620e+01 1.87010734e+02 -1.86488834e+01 7.11100516e+00 9.48812682e+01
1716.lowfreq: -10.5508 -1.0956 -0.0006 -0.0004 0.0005 8.6742 9.3384 31.5062 49.4242
frequency: 4.9737 31.4688 49.4185 62.7230 83.4169 106.2531 119.0648 129.5752 187.9228 227.7931 238.1239 246.9326 283.3800 297.1209 314.1273 351.0608 396.4015 400.7576 417.0702 425.1088 461.6982 476.0713 540.7089 558.4767 587.2038 621.9862 648.2763 704.0599 739.7916 744.6181 753.5963 758.2369 775.2028 800.1184 818.6340 837.3867 884.1769 890.6120 901.6511 909.6651 937.5756 940.7134 970.0884 990.8727 1001.9502 1022.0952 1035.4987 1075.8603 1105.2443 1115.9064 1132.9888 1162.3725 1173.4972 1192.4114 1201.5661 1226.4324 1265.8960 1272.1755 1279.4546 1288.9277 1290.4840 1296.6122 1330.9468 1346.3244 1368.6060 1390.1281 1406.2976 1433.9266 1436.2052 1451.2921 1466.7383 1470.7114 1476.3572 1477.8794 1488.8533 1527.7842 1575.8800 1596.2670 1632.0823 1642.2901 2966.9836 2975.7619 2992.4342 3012.4329 3016.5807 3053.0687 3073.3488 3075.5057 3095.3618 3106.6662 3122.3049 3128.7095 3144.7024 3164.1143 3168.5858 3552.9423
redmass: 4.0092 4.6639 3.7296 1.9760 4.6982 3.1601 5.4961 3.1908 3.6740 1.3160 2.7085 5.2949 4.1005 4.7575 4.0372 7.5300 1.8036 1.7324 3.5207 5.3004 5.4235 2.5296 3.9221 4.4365 6.8395 6.7716 5.4694 5.1135 2.2293 1.4705 3.1074 1.6335 2.2918 1.6215 2.4840 1.4652 1.6925 3.5643 2.4912 4.4798 1.3091 1.3616 1.4501 1.3471 6.1191 2.2635 4.1261 2.4157 2.4672 2.4345 1.5767 1.7316 1.0754 1.5491 1.4829 1.3196 2.1654 1.2856 2.0237 1.1426 1.0927 2.4009 2.0059 1.4335 1.3890 1.2147 5.8524 4.9937 3.2268 1.1102 2.4269 1.0677 1.0469 1.0601 1.0847 3.9887 7.3492 6.3979 8.8923 7.7484 1.0587 1.0362 1.0608 1.0976 1.0589 1.1024 1.1008 1.0998 1.1081 1.0910 1.0858 1.0888 1.0952 1.1003 1.0917 1.0657
irintensity: 0.3481 1.6630 0.8431 0.4236 0.1349 0.6690 0.6223 0.5011 1.1243 0.9539 1.1513 0.2837 5.2046 1.4361 10.5660 3.6530 69.9099 43.4590 9.9746 4.2196 13.3208 40.1309 3.2728 14.7799 4.4003 2.9228 6.3036 20.3812 7.2216 6.4802 5.0507 46.3474 10.3074 3.1194 2.2602 38.7117 25.5973 6.5010 3.1772 0.5617 2.4851 5.5745 15.1762 0.0452 249.9638 8.6468 94.4225 4.6646 259.2245 13.8911 104.2744 32.2413 2.2633 118.5116 124.7367 0.3300 60.5196 12.1644 15.1429 2.8693 1.1987 8.6871 40.9571 3.6675 2.7663 9.0369 20.2735 8.9905 7.1999 18.9913 13.9368 0.1587 10.4547 5.9364 18.5031 20.1004 9.0739 6.6770 104.7755 288.6703 34.4501 34.6647 17.8810 11.6403 57.5708 4.4902 58.1743 54.2539 37.3637 16.1286 4.5386 0.2261 30.6212 34.3755 0.7085 36.1467
temp: 298.150 k
press: 1.00000 atm
elementType: 8 8 8 6 6 6 6 6 6 6 6 6 6 6 6 6 6 6 1 1 1 1 1 1 1 1 1 1 1 1 1 1 1 1
symmnumber: 1
zpe: 717350.0 jmol-1
zpe.correction: 0.273224 hartree
zpe.thermalcorrener: 0.290275 hartree
zpe.thermalcorrenthalpy: 0.291219 hartree
zpe.thermalcorrgfe: 0.225283 hartree
zpe.sumelectzpe: -805.569973 hartree
zpe.sumelectthermal: -805.552922 hartree
zpe.sumelectthermalent: -805.551978 hartree
zpe.sumelectthermalfe: -805.617914 hartree
dipole: -1.9927 -1.0230 0.9320
dipole: 2.4261
quadrupole: -87.6029 -94.9583 -109.9343
quadrupole: -10.4172 -2.5985 6.3366
quadrupole: 9.8956 2.5402 -12.4358 -10.4172 -2.5985 6.3366
hfenergy: -805.8431974 hartree
pointgroup: C01 [X(C15H16O3)]
dipole: 0.773658 0.553048 0.0818051 debye
polarizability: 274.8715527|33.7587829|156.1911792|-0.0001176|-45.1687784|127.1274004 unknown
InChI: InChI=1S/C15H16O3/c1-2-3-8-18-15(17)13-9-11-6-4-5-7-12(11)10-14(13)16/h4-7,9-10,16H,2-3,8H2,1H3
charge 0 multiplicity 1
34 atoms
O  -1.955244 0.41308 -0.749334
O  0.195369 -2.28257 1.728205
O  -2.024384 -1.732942 0.163838
C  -4.262295 0.715878 0.156106
C  -5.77345 0.686115 -0.174995
C  2.150812 0.794821 -0.458905
C  -3.410664 0.297226 -1.050464
C  2.917985 -0.04433 0.439074
C  0.091447 -0.471782 0.101867
C  0.751007 0.55331 -0.594651
C  0.866557 -1.294246 1.004307
C  2.241479 -1.076076 1.158443
C  -1.36723 -0.705761 -0.120214
C  -6.64502 1.109203 1.027236
C  2.815235 1.839452 -1.183552
C  4.325562 0.195723 0.57693
C  4.186679 2.051097 -1.030251
C  4.944989 1.220746 -0.142148
H  -3.968838 1.735255 0.474332
H  -4.053332 0.032291 1.000154
H  -6.059213 -0.335679 -0.497054
H  -5.978618 1.356387 -1.03491
H  -3.632767 -0.744746 -1.345276
H  -3.55814 0.975987 -1.907755
H  0.158901 1.180381 -1.267157
H  2.817261 -1.706385 1.850117
H  -6.482646 0.434988 1.888667
H  -6.397955 2.136842 1.353628
H  -7.7207 1.08303 0.774257
H  2.227588 2.470152 -1.861068
H  4.911405 -0.436411 1.254733
H  4.689187 2.849754 -1.585958
H  6.020832 1.395397 -0.02964
H  0.829901 -2.769083 2.313836
