program: Gaussian 09
title: 000250129
version: EM64L-G09RevD.01
frameworkgroup: C1[X(C15H16O)]
method: RPBEPBE
basis: SDD
operation: Freq
keyword: #pfreq=noraman
keyword: PBEPBE/SDD
title: #p freq=noraman PBEPBE/SDD
converged: YES YES NO NO
title: Mulliken charges:
elementType: O C C C C C C C C C C C C C C C H H H H H H H H H H H H H H H H
charge: -0.467692 -0.468167 -0.206433 -0.545238 0.428187 0.509468 -0.411045 -0.383950 -0.406473 -0.423608 -0.234102 -0.226196 -0.229532 -0.226298 -0.242042 -0.244746 0.226122 0.222037 0.212802 0.234115 0.217554 0.227554 0.282911 0.233842 0.230515 0.344410 0.223861 0.224002 0.222797 0.222372 0.226458 0.226518
chargesum: 0.00000
title: Mulliken charges with hydrogens summed into heavy atoms:
elementType: O C C C C C C C C C C C C C C C
charge: -0.123282 -0.020008 0.006369 -0.093570 0.428187 0.509468 -0.183491 -0.101039 -0.172631 -0.193093 -0.010241 -0.002194 -0.006736 -0.003927 -0.015584 -0.018228
polarizability: 1.92377148e+02 -1.77865626e+01 1.57691336e+02 -1.62054434e+01 -1.47562249e+01 1.16430206e+02
1716.lowfreq: -10.0847 -0.0005 0.0003 0.0008 4.7817 13.7961 21.8324 27.5768 33.0732
frequency: 19.1813 27.5163 32.7308 62.5856 87.4093 144.2245 180.6630 218.8242 266.9423 285.0267 311.2239 344.1116 399.0245 403.6647 404.8586 477.5994 496.1612 514.9084 577.8369 617.0419 617.6539 664.0402 705.0858 707.2208 740.7946 759.6301 774.9912 797.0520 834.9340 853.3168 857.2741 886.9137 918.1994 926.4432 974.8120 978.8795 986.4856 989.6891 989.7466 993.2970 999.2959 1019.1265 1026.0704 1028.2183 1065.3695 1079.2076 1092.6949 1143.5936 1153.7832 1171.1239 1171.5164 1185.2484 1186.6169 1217.7106 1218.2329 1241.0577 1273.5237 1303.5270 1320.7494 1325.8486 1357.9636 1381.6025 1381.8197 1391.1034 1437.8733 1439.6682 1458.4586 1482.0495 1483.7213 1485.8330 1592.4083 1594.2978 1613.6752 1616.4000 2929.2795 2969.3599 2997.1130 3024.9090 3060.0852 3111.1848 3112.7282 3113.0993 3126.0352 3129.8130 3139.5924 3141.5125 3158.3197 3160.6166 3176.8115 3575.2310
redmass: 3.8220 4.5708 3.8494 3.8105 4.5652 3.6480 4.5733 4.0802 2.9984 1.2557 2.2129 2.9216 3.9053 2.8246 3.2340 3.8280 3.2043 3.8602 4.3383 6.4133 6.3597 4.6462 1.8267 1.7306 2.2997 2.0003 1.4862 2.0494 3.3497 1.2528 1.2509 2.5608 1.5681 1.4246 1.3974 1.4128 2.2337 6.0345 6.2110 1.3660 1.3525 2.3277 2.1877 2.0740 3.0490 1.5982 1.6574 1.1887 1.4606 1.0517 1.0557 1.1125 1.1283 2.3937 1.3753 1.4658 1.1810 1.3644 1.2950 1.2560 1.4164 4.9371 4.9093 2.1482 2.1827 2.1787 1.1058 1.4818 1.6087 2.1650 6.0548 6.2774 6.1891 6.1213 1.0820 1.0646 1.0595 1.0970 1.1034 1.0871 1.0865 1.0873 1.0868 1.0907 1.0932 1.0958 1.0986 1.1014 1.0957 1.0660
irintensity: 0.0333 0.0390 0.3285 0.1354 1.0740 1.0959 8.2978 3.8476 31.2848 132.9742 32.7432 1.0928 1.5462 0.0041 1.4094 1.1762 10.5267 15.7132 8.3418 0.1297 0.0867 13.1469 30.8613 84.1586 22.0287 69.1081 0.3644 7.5129 2.9780 0.0893 0.1991 20.0439 7.0076 4.2267 0.1154 0.1191 7.1628 0.0839 0.1583 0.6358 2.9878 46.1549 7.7878 8.7544 5.8283 3.0956 2.2574 72.1772 2.6310 0.2456 0.4938 0.0392 3.6478 0.5069 4.8212 21.6490 0.4293 4.2244 6.0420 0.2289 0.7873 5.4628 5.1565 15.2588 10.2603 8.7320 2.5789 16.4629 10.0918 20.6000 1.3632 0.9129 14.1447 6.7190 42.2360 43.5239 23.0930 11.7128 25.0437 11.6431 9.9132 7.2950 1.5785 10.6516 33.9245 47.1501 30.5756 25.0425 6.1773 5.7949
temp: 298.150 k
press: 1.00000 atm
elementType: 8 6 6 6 6 6 6 6 6 6 6 6 6 6 6 6 1 1 1 1 1 1 1 1 1 1 1 1 1 1 1 1
symmnumber: 1
zpe: 697979.6 jmol-1
zpe.correction: 0.265846 hartree
zpe.thermalcorrener: 0.280222 hartree
zpe.thermalcorrenthalpy: 0.281166 hartree
zpe.thermalcorrgfe: 0.221781 hartree
zpe.sumelectzpe: -655.260842 hartree
zpe.sumelectthermal: -655.246466 hartree
zpe.sumelectthermalent: -655.245522 hartree
zpe.sumelectthermalfe: -655.304907 hartree
dipole: -0.9301 0.0909 1.3806
dipole: 1.6672
quadrupole: -95.2474 -86.2947 -93.5704
quadrupole: -7.1311 -1.9327 -0.6985
quadrupole: -3.5433 5.4095 -1.8662 -7.1311 -1.9327 -0.6985
hfenergy: -655.5266879 hartree
pointgroup: C01 [X(C15H16O1)]
dipole: 0.3459813 0.1218862 -0.5437496 debye
polarizability: 191.7616725|20.5493383|151.1124922|-15.4943639|20.1210993|123.6245249 unknown
InChI: InChI=1S/C15H16O/c16-15(14-9-5-2-6-10-14)12-11-13-7-3-1-4-8-13/h1-10,15-16H,11-12H2
charge 0 multiplicity 1
32 atoms
O  -1.318751 2.644574 0.370132
C  0.121904 1.01931 -0.853197
C  -1.313383 1.579621 -0.651198
C  0.72633 0.365449 0.417906
C  -2.314014 0.513765 -0.216443
C  2.174198 -0.049345 0.204701
C  -2.679644 -0.508466 -1.128725
C  -2.87968 0.514346 1.080788
C  2.48961 -1.29493 -0.399149
C  3.242533 0.810944 0.56876
C  -3.587838 -1.521065 -0.748234
C  -3.790121 -0.49826 1.461627
C  3.831276 -1.6691 -0.637011
C  4.58685 0.442158 0.333171
C  -4.146031 -1.52033 0.552022
C  4.886406 -0.799952 -0.272779
H  0.103958 0.27862 -1.676628
H  0.781851 1.845282 -1.192885
H  -1.648702 2.005915 -1.623581
H  0.112176 -0.512801 0.691344
H  0.648292 1.085479 1.253995
H  -2.26032 -0.511719 -2.14328
H  -2.608689 1.317542 1.771156
H  1.676321 -1.978314 -0.675369
H  3.01839 1.772197 1.048785
H  -0.677684 3.34611 0.092997
H  -3.863866 -2.303556 -1.464299
H  -4.223954 -0.48664 2.468176
H  4.054758 -2.637563 -1.099377
H  5.398483 1.118015 0.626731
H  -4.853348 -2.303022 0.848745
H  5.927786 -1.089765 -0.452981
