program: Gaussian 09
title: 000250128
version: EM64L-G09RevD.01
frameworkgroup: C1[X(C14H26O4S)]
method: RPBEPBE
basis: SDD
operation: Freq
keyword: #p
keyword: freq=noraman
keyword: PBEPBE/SDD
title: #p freq=noraman PBEPBE/SDD
converged: YES YES NO NO
title: Mulliken charges:
elementType: S O O O O C C C C C C C C C C C C C C H H H H H H H H H H H H H H H H H H H H H H H H H H
charge: 0.191696 -0.255207 -0.255007 -0.251835 -0.251616 -0.053379 -0.053597 -0.503406 -0.502922 -0.695118 -0.693934 -0.695723 -0.694628 0.275721 0.275062 -0.299939 -0.299306 -0.643897 -0.642937 0.210316 0.210707 0.243838 0.224001 0.243784 0.223560 0.219136 0.219934 0.212957 0.249945 0.204313 0.207324 0.218981 0.220647 0.212920 0.250183 0.204708 0.207363 0.240181 0.242205 0.240096 0.242099 0.293432 0.257204 0.293279 0.256859
chargesum: 0.00000
title: Mulliken charges with hydrogens summed into heavy atoms:
elementType: S O O O O C C C C C C C C C C C C C C
charge: 0.191696 -0.255207 -0.255007 -0.251835 -0.251616 0.156936 0.157110 -0.035566 -0.035579 -0.043091 -0.032352 -0.043175 -0.032373 0.275721 0.275062 0.182447 0.182890 -0.093262 -0.092799
polarizability: 2.36480266e+02 -2.20263879e-01 1.61515253e+02 5.60243366e+00 1.65093678e-01 1.54965460e+02
1716.lowfreq: -18.2861 -11.6070 -4.3049 -0.0020 -0.0018 -0.0015 1.6384 8.3575 11.2957
frequency: -12.0881 -7.4839 11.1578 19.2193 24.5398 35.1668 44.8125 56.1018 72.6085 77.3118 108.5286 144.5005 146.6082 151.5809 169.7493 215.9519 216.6186 221.0747 237.5657 243.4876 249.1464 275.9979 280.3389 333.7291 337.6424 354.0674 356.0764 402.4718 407.8545 434.9502 438.2880 503.5791 506.0813 573.3150 574.5064 632.3365 640.9177 715.1135 718.4070 767.1023 771.2012 785.7940 786.3547 871.6275 872.6921 894.4537 896.1480 922.7565 924.5755 933.6707 937.4759 962.8542 963.9773 965.9008 966.3276 1001.7934 1008.2884 1046.9467 1054.3734 1065.9496 1069.8966 1104.5751 1105.3667 1159.0706 1161.4134 1180.1995 1183.0440 1191.0673 1192.1593 1222.5083 1238.5839 1240.1951 1246.4485 1272.8147 1274.7344 1291.0253 1316.6786 1327.5561 1327.6200 1349.5282 1349.6959 1366.7376 1367.3025 1382.6640 1383.4712 1400.4498 1401.7643 1435.6822 1437.3606 1440.8954 1447.3743 1448.3778 1450.4523 1465.1200 1465.2155 1471.5433 1472.9724 1483.7957 1484.3566 1487.3261 1489.9009 1633.6265 1633.8806 2970.5338 2971.4007 2973.6665 2974.6558 2979.2949 2980.0876 3007.5456 3008.8670 3009.7844 3010.9326 3021.0479 3021.2013 3067.7170 3068.0651 3069.7990 3069.8620 3077.0389 3077.2667 3085.6631 3085.9170 3086.6243 3089.4608 3089.7301 3089.8990 3111.9652 3112.5757
redmass: 3.4329 3.2345 4.6505 5.9683 4.6501 6.1237 5.2046 9.8829 2.7158 2.6972 5.9328 3.5860 3.6180 3.7002 3.2976 2.9104 1.2416 1.0965 2.0363 1.5772 1.1082 3.0192 3.3204 2.4216 2.2973 2.2158 2.1904 2.1272 2.1668 3.0099 2.9386 2.8992 2.8646 4.2555 4.3480 4.9858 3.2171 4.7164 4.8310 2.8515 3.0587 3.6844 3.7633 2.2769 2.2693 1.6438 1.5927 1.4370 1.3409 1.7410 2.0223 1.8206 1.7619 1.7708 1.9070 1.7149 1.7599 2.5338 2.2858 2.3041 2.3765 1.4896 1.4828 2.5984 2.6147 1.3377 1.3189 2.1507 2.1506 1.2220 1.2449 1.2705 1.2116 1.4875 1.5131 1.1589 1.2262 1.5111 1.5094 1.3212 1.3250 1.3232 1.3179 1.2109 1.2122 1.2149 1.2158 1.0955 1.0954 1.0897 1.0917 1.1034 1.1011 1.0427 1.0437 1.0553 1.0560 1.0456 1.0470 1.0542 1.0551 8.8887 8.9373 1.0776 1.0736 1.0405 1.0370 1.0397 1.0397 1.0582 1.0588 1.0624 1.0622 1.0612 1.0615 1.0994 1.0999 1.0994 1.0998 1.0998 1.0997 1.1019 1.1030 1.1007 1.0996 1.0996 1.1051 1.1042 1.1044
irintensity: 0.0048 0.1748 0.0316 0.4850 0.0996 0.0969 4.7801 2.5448 0.4119 0.2938 0.0235 2.5074 1.0537 4.3190 0.0146 1.0879 0.0522 0.0693 13.9905 6.9383 0.6670 1.8400 0.8323 0.0813 15.2728 0.8933 1.5423 8.7523 2.2534 3.0258 0.6232 1.4570 14.2313 3.8064 5.2996 7.0455 0.1638 3.6905 13.0181 21.8990 1.3935 3.6946 1.4211 9.3013 9.3624 13.5399 3.6437 8.6139 4.9632 52.4171 3.3323 25.3983 2.2286 6.2646 0.2075 3.3443 66.5759 4.6632 7.6828 328.6331 11.8472 8.6480 7.6915 356.3688 12.6822 2.1687 22.5583 49.9829 20.8470 2.5688 0.8170 24.9833 0.8556 138.9490 41.9955 19.9087 11.0109 1.6716 1.7247 29.1323 0.2713 2.4555 4.3799 23.1562 24.2590 18.6025 17.9396 12.3865 14.6528 21.6888 15.2622 11.3139 9.7019 2.0356 2.1472 5.2228 6.0125 21.7332 22.9489 16.4768 16.2863 93.5631 171.7644 23.3099 23.2033 30.9035 33.9393 30.7250 29.9149 17.0617 1.3949 14.6262 15.4234 22.2869 52.5826 42.5747 33.7238 31.9999 23.3234 59.7387 40.1404 4.5831 22.3659 22.7693 36.4595 37.3133 0.6773 21.4456 4.9501
temp: 298.150 k
press: 1.00000 atm
elementType: 16 8 8 8 8 6 6 6 6 6 6 6 6 6 6 6 6 6 6 1 1 1 1 1 1 1 1 1 1 1 1 1 1 1 1 1 1 1 1 1 1 1 1 1 1
symmnumber: 1
zpe: 1000656.6 jmol-1
zpe.correction: 0.381130 hartree
zpe.thermalcorrener: 0.403497 hartree
zpe.thermalcorrenthalpy: 0.404441 hartree
zpe.thermalcorrgfe: 0.325530 hartree
zpe.sumelectzpe: -1246.506314 hartree
zpe.sumelectthermal: -1246.483947 hartree
zpe.sumelectthermalent: -1246.483003 hartree
zpe.sumelectthermalfe: -1246.561914 hartree
dipole: -0.0079 1.0960 0.0323
dipole: 1.0965
quadrupole: -122.8600 -124.6984 -117.8102
quadrupole: 0.2481 -2.5821 -0.4287
quadrupole: -1.0705 -2.9089 3.9793 0.2481 -2.5821 -0.4287
hfenergy: -1246.8874439 hartree
pointgroup: C01 [X(C14H26O4S1)]
dipole: -0.0043496 0.4303417 -0.0299831 debye
polarizability: 235.591794|-0.5538789|161.484328|-10.13723|-0.4484922|155.884857 unknown
InChI: InChI=1S/C14H26O4S/c1-11(2)9-13(15)17-5-7-19-8-6-18-14(16)10-12(3)4/h11-12H,5-10H2,1-4H3
charge 0 multiplicity 1
45 atoms
S  0.006992 -0.072878 0.060299
O  -2.847882 0.493179 1.354136
O  2.851411 0.339025 -1.316643
O  -4.340568 -1.159449 0.665865
O  4.35793 -1.23072 -0.479473
C  -6.154255 1.471715 0.734949
C  6.154197 1.385917 -0.901381
C  -4.75585 1.216543 0.081159
C  4.783901 1.194007 -0.169719
C  -6.032831 1.711729 2.258257
C  -7.16687 0.346906 0.417858
C  5.97515 1.453656 -2.436515
C  7.189584 0.31018 -0.498922
C  -4.007214 0.049731 0.696264
C  4.022976 -0.031809 -0.636012
C  -2.005691 -0.560523 1.987507
C  2.000486 -0.775095 -1.821019
C  -1.132642 -1.288719 0.965966
C  1.137013 -1.383793 -0.716653
H  -6.526391 2.408396 0.270022
H  6.532112 2.371165 -0.557508
H  -4.128714 2.119359 0.169321
H  -4.901612 0.994315 -0.993137
H  4.147769 2.081273 -0.325006
H  4.973599 1.081845 0.914564
H  -5.710975 0.790197 2.779176
H  -5.298601 2.5059 2.487106
H  -7.008673 2.011348 2.682253
H  -6.823458 -0.621183 0.822111
H  -8.152842 0.581523 0.860549
H  -7.302584 0.224891 -0.673045
H  5.651892 0.475968 -2.84161
H  5.21987 2.207578 -2.72501
H  6.930682 1.717451 -2.925654
H  6.835335 -0.700323 -0.767114
H  8.152382 0.491646 -1.011814
H  7.375613 0.321141 0.591371
H  -2.665919 -1.287557 2.495463
H  -1.398308 -0.007003 2.720761
H  2.653422 -1.555856 -2.253064
H  1.385912 -0.303872 -2.604049
H  -1.752262 -1.827176 0.230643
H  -0.493291 -2.012561 1.504184
H  1.762895 -1.839979 0.067454
H  0.491309 -2.160887 -1.165786
