program: Gaussian 09
title: 000250126
version: EM64L-G09RevD.01
frameworkgroup: C1[X(C14H22O)]
method: RPBEPBE
basis: SDD
operation: Freq
keyword: #pfreq=noraman
keyword: PBEPBE/SDD
title: #p freq=noraman PBEPBE/SDD
converged: YES YES NO NO
title: Mulliken charges:
elementType: O C C C C C C C C C C C C C C H H H H H H H H H H H H H H H H H H H H H H
charge: -0.443515 -0.445471 -0.363073 -0.070911 -0.372299 -0.354989 -0.560127 -0.356314 0.476202 -0.696242 -0.395678 -0.446124 -0.234717 -0.225340 -0.248478 0.192972 0.202243 0.219656 0.193094 0.223305 0.186965 0.188567 0.189338 0.190742 0.208024 0.211213 0.194195 0.194156 0.321597 0.214997 0.210129 0.210340 0.289265 0.225078 0.222940 0.222509 0.225750
chargesum: 0.00000
title: Mulliken charges with hydrogens summed into heavy atoms:
elementType: O C C C C C C C C C C C C C C
charge: -0.121918 -0.050256 0.049677 0.152394 0.003233 0.025091 -0.140889 0.032037 0.476202 -0.060777 -0.106413 -0.221045 -0.011776 -0.002832 -0.022727
polarizability: 2.03067125e+02 -9.12089761e-01 1.44325701e+02 1.60332743e+01 -1.08167494e+00 1.08284400e+02
1716.lowfreq: -16.0416 -7.0569 -4.7817 -0.0007 -0.0005 0.0005 18.6187 27.9192 32.0930
frequency: 18.1558 26.6144 31.9057 44.4395 66.9937 99.4769 105.0865 124.6517 144.1802 179.0235 191.6964 229.2284 245.6963 279.2291 302.4994 324.1465 400.9028 405.4831 426.6908 443.7642 479.9083 543.5715 599.4674 617.7508 707.2949 721.9078 735.4302 745.3002 776.9492 800.4133 822.3976 860.3088 865.0562 887.9579 909.6657 943.5388 981.5499 984.3394 988.7007 995.0182 1004.3202 1019.5280 1029.5320 1043.6156 1059.2897 1073.7627 1080.4194 1082.1779 1094.4769 1121.8822 1163.5758 1170.9511 1189.3735 1190.7105 1208.2266 1218.4096 1236.3433 1258.9452 1268.0741 1283.3476 1287.5048 1292.9881 1314.7983 1319.0670 1334.9782 1348.9576 1353.4295 1357.4730 1370.4235 1382.2927 1388.0005 1435.9969 1445.8205 1456.5703 1461.7065 1464.3281 1473.6025 1476.3794 1482.0933 1483.7943 1487.8858 1589.9894 1614.7524 2937.7888 2943.5209 2947.9165 2954.0413 2965.0379 2969.6427 2971.3008 2985.4444 2998.6279 3003.1141 3016.8742 3026.5831 3040.9058 3049.1418 3068.0461 3070.0300 3108.8843 3121.9377 3134.9476 3147.7050 3160.3456 3533.4884
redmass: 3.9986 2.1610 3.2558 2.7797 3.4546 2.6774 2.1230 2.9288 2.1690 4.0088 3.9818 1.1039 2.7928 2.7779 3.1159 1.3377 3.4215 2.8552 2.3905 2.4815 2.7791 3.6215 3.8278 6.2270 2.1061 1.0654 1.1378 1.5312 1.3494 3.9996 2.5954 1.2555 1.3710 1.8706 1.4314 1.5213 1.3469 1.3420 5.5401 4.1515 1.3356 3.6448 2.2006 3.0338 1.6453 2.3767 1.9408 1.8183 1.5695 2.6301 1.2313 1.0589 1.3905 1.2921 2.2676 1.3125 1.3502 1.2854 1.2341 1.0688 1.1691 1.2771 1.2902 1.3636 1.3916 1.4886 1.6330 1.6466 1.3075 4.2075 1.2169 1.4807 1.3778 1.1167 1.0666 1.0785 1.0738 1.0427 1.0867 2.2496 1.0889 5.9999 6.0306 1.0654 1.0628 1.0595 1.0589 1.0600 1.0615 1.0364 1.0964 1.0950 1.1004 1.0906 1.1030 1.0956 1.0969 1.1007 1.0993 1.0871 1.0864 1.0923 1.0954 1.1014 1.0656
irintensity: 0.0424 0.1292 0.0753 0.2033 0.7244 0.1177 0.5124 1.9310 0.1475 0.8412 4.6558 0.0108 3.9343 11.8152 1.5633 160.4370 8.1443 1.1730 4.2966 0.6701 9.9625 21.1947 13.7305 0.8730 41.0091 12.7905 2.5474 51.6101 0.4213 4.1757 17.0569 0.6873 1.5909 3.9056 9.7999 11.8991 7.0254 12.1751 1.8558 9.9070 4.2061 4.1911 17.2101 9.4206 6.7854 0.0991 10.5470 18.2769 7.2803 18.6393 12.1627 0.1244 1.8420 0.9661 0.7702 15.4472 4.2556 1.1930 2.4671 1.1058 1.5469 1.3605 4.5933 4.2434 0.0674 3.9187 4.9734 3.7583 18.8150 1.6409 10.9590 2.3170 5.7342 11.3263 0.0369 1.0685 2.2747 12.4017 2.7963 29.0428 23.7835 1.3244 14.1581 13.6635 23.2236 19.5226 5.8596 21.9399 111.7402 45.5639 4.0105 6.1445 0.6777 22.8966 18.0687 18.3069 116.1121 97.0611 55.2850 11.1614 1.9766 30.7612 13.2810 34.5323 2.6174
temp: 298.150 k
press: 1.00000 atm
elementType: 8 6 6 6 6 6 6 6 6 6 6 6 6 6 6 1 1 1 1 1 1 1 1 1 1 1 1 1 1 1 1 1 1 1 1 1 1
symmnumber: 1
zpe: 853125.9 jmol-1
zpe.correction: 0.324938 hartree
zpe.thermalcorrener: 0.341920 hartree
zpe.thermalcorrenthalpy: 0.342864 hartree
zpe.thermalcorrgfe: 0.277236 hartree
zpe.sumelectzpe: -620.734060 hartree
zpe.sumelectthermal: -620.717078 hartree
zpe.sumelectthermalent: -620.716134 hartree
zpe.sumelectthermalfe: -620.781762 hartree
dipole: 0.8594 -1.6046 0.9315
dipole: 2.0447
quadrupole: -93.7108 -92.1016 -91.3854
quadrupole: 0.6223 2.4819 0.9459
quadrupole: -1.3116 0.2977 1.0138 0.6223 2.4819 0.9459
hfenergy: -621.0589982 hartree
pointgroup: C01 [X(C14H22O1)]
dipole: -0.3494154 0.2784478 0.6689818 debye
polarizability: 202.9943307|9.9890613|130.5971151|-12.8866947|17.4767427|122.0857802 unknown
InChI: InChI=1S/C14H22O/c1-2-3-4-8-11-14(15)12-13-9-6-5-7-10-13/h5-7,9-10,14-15H,2-4,8,11-12H2,1H3
charge 0 multiplicity 1
37 atoms
O  0.218342 -1.684828 -0.078547
C  -1.163546 0.211161 0.754801
C  -2.352358 -0.10858 -0.17688
C  0.20197 -0.220238 0.17621
C  -3.722501 0.212063 0.461055
C  -4.913718 -0.066035 -0.483239
C  1.386596 0.206046 1.079825
C  -6.287352 0.233951 0.159493
C  2.765624 0.200253 0.423839
C  -7.471521 -0.040907 -0.79252
C  3.157761 -0.81044 -0.494611
C  3.699936 1.218864 0.747084
C  4.4483 -0.796268 -1.070303
C  4.992999 1.230867 0.176624
C  5.373091 0.220219 -0.735937
H  -1.313001 -0.283886 1.739998
H  -1.137125 1.301815 0.95607
H  -2.310002 -1.177825 -0.462372
H  -2.240769 0.468869 -1.118214
H  0.328823 0.20474 -0.836249
H  -3.746389 1.277083 0.775448
H  -3.844077 -0.387254 1.388225
H  -4.801411 0.542068 -1.40524
H  -4.88582 -1.127479 -0.807091
H  1.182407 1.223443 1.467077
H  1.389557 -0.460154 1.971262
H  -6.3125 1.293667 0.486795
H  -6.399976 -0.377459 1.078299
H  0.096568 -2.145805 0.792021
H  -8.441095 0.182049 -0.310121
H  -7.397634 0.579523 -1.705747
H  -7.487306 -1.100931 -1.109384
H  2.440568 -1.596745 -0.752843
H  3.41109 2.010962 1.450219
H  4.733335 -1.582209 -1.7795
H  5.698734 2.027303 0.439769
H  6.3742 0.226893 -1.181917
