program: Gaussian 09
title: 000250125
version: EM64L-G09RevD.01
frameworkgroup: C1[X(C14H20O2)]
method: RPBEPBE
basis: SDD
operation: Freq
keyword: #pfreq=noraman
keyword: PBEPBE/SDD
title: #p freq=noraman PBEPBE/SDD
converged: YES YES NO NO
title: Mulliken charges:
elementType: O O C C C C C C C C C C C C C C H H H H H H H H H H H H H H H H H H H H
charge: -0.289989 -0.249819 -0.258287 -0.202729 -0.241212 -0.525149 -0.500837 -0.221019 -0.224264 0.230477 0.004335 -0.450423 -0.436782 -0.381431 -0.394485 -0.384311 0.250319 0.240858 0.271537 0.249235 0.246508 0.221066 0.264119 0.239624 0.238390 0.243964 0.243556 0.200374 0.193968 0.215742 0.202875 0.199272 0.197902 0.216063 0.188789 0.201761
chargesum: 0.00000
title: Mulliken charges with hydrogens summed into heavy atoms:
elementType: O O C C C C C C C C C C C C C C
charge: -0.289989 -0.249819 -0.007968 0.038129 0.030326 -0.029406 -0.015652 0.018606 0.014126 0.230477 0.248299 -0.006493 -0.027072 0.020716 0.019480 0.006239
polarizability: 1.79320629e+02 -1.23804675e+00 1.35749218e+02 -5.27946656e-01 -3.16831572e+00 1.23337606e+02
1716.lowfreq: -25.1951 -11.4362 -0.0009 -0.0006 -0.0003 4.3995 20.5555 35.8837 60.0323
frequency: 15.5951 35.1246 59.9037 72.9870 118.1520 147.6829 206.4442 222.0379 234.1691 298.2435 323.3467 353.0183 367.0896 408.3364 459.0261 468.0511 474.2921 492.6682 621.7775 642.3945 671.9174 704.6562 720.3898 770.1830 772.8952 777.6340 795.0227 806.3735 838.5209 858.3649 864.4724 872.0417 879.2919 901.0314 905.8193 914.4332 923.0678 930.0851 951.4376 983.4062 1002.4917 1011.5472 1019.3766 1030.9791 1047.4022 1051.0027 1085.4370 1088.9594 1105.6943 1112.6430 1116.6666 1128.1954 1141.7348 1153.4250 1163.8288 1179.8799 1230.6408 1232.9204 1253.6074 1257.4463 1263.7508 1268.1737 1272.5215 1283.8680 1312.1513 1315.4401 1324.5640 1330.7192 1334.3399 1337.5398 1350.3017 1358.3074 1360.5348 1445.5582 1459.4719 1459.7404 1460.0602 1469.5480 1473.4541 1476.0080 1579.4113 1619.5923 2961.0786 2976.8596 2980.5633 2981.0932 2987.7649 3020.3963 3022.5233 3028.5295 3032.0286 3038.7630 3045.2818 3052.3017 3057.0393 3062.2914 3081.6022 3089.6243 3091.2541 3099.7635 3153.7837 3187.0511
redmass: 3.5730 3.6501 4.5892 4.4378 3.3707 3.9288 2.4759 4.0915 3.1505 4.3815 2.2640 2.1374 2.4451 2.7430 2.5960 2.2821 1.9053 2.6468 3.2285 3.4927 3.8485 4.5383 1.7685 1.5173 4.9482 3.6586 3.2078 3.0985 2.8790 2.4029 2.2380 1.9520 2.7043 2.6574 2.5756 1.7233 1.4126 1.6004 2.7450 2.0912 2.0125 2.7482 1.7786 1.8623 1.4179 1.6644 1.6321 1.2562 1.6852 1.4817 1.0672 1.7652 1.4454 1.5322 1.7194 1.3239 1.3207 1.2999 1.5390 1.2393 1.3623 1.2382 1.6044 1.4138 1.4094 1.6999 1.7179 1.3752 1.5712 1.5514 1.4752 1.4358 1.4695 1.0869 1.0865 1.0855 1.0894 1.0814 1.1106 1.0922 5.6963 9.4951 1.0635 1.0642 1.0616 1.0634 1.0623 1.0590 1.0595 1.0922 1.0907 1.0998 1.0987 1.0998 1.1013 1.0871 1.0887 1.0935 1.1039 1.1067 1.0872 1.1097
irintensity: 0.0489 0.6640 0.5871 0.5628 0.4115 0.9135 3.3708 2.6186 3.3808 8.5210 1.1944 2.4790 1.3590 2.8098 4.0947 1.9688 1.8820 3.5061 5.8210 4.4593 4.1403 4.2422 49.8185 0.8047 0.5857 8.2820 6.4206 2.8178 19.1631 2.9860 10.5532 16.5835 29.9071 4.9421 11.2233 2.0425 9.2035 2.4440 0.8958 9.5406 13.5891 26.1335 9.8098 56.0030 0.9090 18.9277 0.0345 9.6258 198.5411 92.5041 4.0033 73.4774 63.4646 17.4557 4.6352 0.2931 13.7159 8.3021 7.6035 1.4153 4.1702 5.0848 6.8341 8.2056 24.8386 3.1651 24.4713 2.8117 23.0967 15.9141 4.9483 1.4589 2.9733 10.2706 11.5012 2.6508 11.9637 24.2947 12.8467 5.4318 2.9435 133.0320 40.6577 7.1896 54.0640 12.8498 33.1027 39.5933 13.6072 83.1236 7.1485 60.3377 29.9387 11.2569 105.2097 7.0511 65.7754 6.8634 24.6659 20.5499 7.4435 22.8860
temp: 298.150 k
press: 1.00000 atm
elementType: 8 8 6 6 6 6 6 6 6 6 6 6 6 6 6 6 1 1 1 1 1 1 1 1 1 1 1 1 1 1 1 1 1 1 1 1
symmnumber: 1
zpe: 818125.6 jmol-1
zpe.correction: 0.311608 hartree
zpe.thermalcorrener: 0.325904 hartree
zpe.thermalcorrenthalpy: 0.326848 hartree
zpe.thermalcorrgfe: 0.268644 hartree
zpe.sumelectzpe: -694.686461 hartree
zpe.sumelectthermal: -694.672165 hartree
zpe.sumelectthermalent: -694.671220 hartree
zpe.sumelectthermalfe: -694.729424 hartree
dipole: -0.9612 1.2225 -0.7727
dipole: 1.7366
quadrupole: -87.0100 -100.3683 -96.3368
quadrupole: 1.1283 -2.5403 1.7896
quadrupole: 7.5617 -5.7966 -1.7651 1.1283 -2.5403 1.7896
hfenergy: -694.9980686 hartree
pointgroup: C01 [X(C14H20O2)]
dipole: -0.3549542 0.5525259 0.1884519 debye
polarizability: 178.6852036|-0.5371319|132.010807|-5.745519|6.6157368|127.7114421 unknown
InChI: InChI=1S/C14H20O2/c15-14(16-12-4-2-1-3-5-12)13-9-10-6-7-11(13)8-10/h6-7,10-13H,1-5,8-9H2
charge 0 multiplicity 1
36 atoms
O  -1.045667 0.231099 -0.767049
O  0.114931 -1.748182 -1.195158
C  1.853182 0.452498 0.644453
C  3.67671 -0.307677 -0.487785
C  1.339377 0.389486 -0.876679
C  2.771311 -0.807333 0.68222
C  2.592483 -0.169426 -1.631084
C  2.89858 1.572214 0.664541
C  3.994034 1.115063 -0.010772
C  0.11861 -0.510047 -0.982865
C  -2.353047 -0.526392 -0.761296
C  -2.562306 -1.176363 0.621406
C  -3.434027 0.514263 -1.094485
C  -2.734385 -0.123604 1.741011
C  -3.608074 1.559712 0.033719
C  -3.864482 0.878703 1.40017
H  1.040063 0.524855 1.382145
H  4.537649 -0.934878 -0.763143
H  1.048966 1.400634 -1.203317
H  2.241086 -1.747443 0.450031
H  3.318434 -0.898084 1.63541
H  2.923944 0.502688 -2.439658
H  2.365935 -1.161133 -2.059928
H  2.726781 2.576859 1.060243
H  4.897026 1.675805 -0.268015
H  -2.275074 -1.305132 -1.542667
H  -1.722185 -1.860981 0.837342
H  -3.476796 -1.801547 0.55742
H  -4.387326 -0.032609 -1.244904
H  -3.185431 1.008357 -2.051944
H  -1.783618 0.431674 1.867598
H  -2.943717 -0.631642 2.701818
H  -4.441184 2.243426 -0.218498
H  -2.689701 2.174658 0.097723
H  -4.834376 0.338924 1.36608
H  -3.951005 1.642856 2.196518
