program: Gaussian 09
title: 000250124
version: EM64L-G09RevD.01
frameworkgroup: C1[X(C14H18O5)]
method: RPBEPBE
basis: SDD
operation: Freq
keyword: #pfreq=noraman
keyword: PBEPBE/SDD
title: #p freq=noraman PBEPBE/SDD
converged: YES YES NO NO
title: Mulliken charges:
elementType: O O O O O C C C C C C C C C C C C C C H H H H H H H H H H H H H H H H H H
charge: -0.305015 -0.304737 -0.280364 -0.277897 -0.253853 0.376774 0.068910 0.206588 -0.396813 -0.350742 -0.247908 -0.229519 -0.306337 -0.260761 -0.356112 0.220656 -0.526923 -0.527991 -0.495839 0.236163 0.255414 0.293917 0.232057 0.238156 0.242381 0.228923 0.198102 0.246062 0.235564 0.229480 0.257274 0.255774 0.224102 0.231970 0.206314 0.201994 0.234236
chargesum: 0.00000
title: Mulliken charges with hydrogens summed into heavy atoms:
elementType: O O O O O C C C C C C C C C C C C C C
charge: -0.305015 -0.304737 -0.280364 -0.277897 -0.253853 0.376774 0.068910 0.206588 -0.160650 -0.095328 0.046009 0.002538 0.174200 0.166264 -0.110051 0.220656 0.195396 0.183854 0.146704
polarizability: 3.04414419e+02 4.68574595e-01 1.74424906e+02 1.62589727e+01 4.23896333e+00 1.04173377e+02
1716.lowfreq: -12.8158 -4.5554 -0.0008 -0.0007 -0.0003 3.5492 10.3185 24.5935 40.2722
frequency: -1.1417 24.4408 40.2191 55.4834 62.1233 67.0841 87.9162 98.4054 110.0793 123.8080 153.2636 156.8540 162.5664 168.5967 200.7487 211.9389 220.0797 235.4110 256.3529 274.2462 297.1786 350.0985 371.9355 388.2245 418.4321 448.1237 501.6695 534.0381 555.5653 576.7790 592.8940 642.0863 688.4026 708.4096 753.2411 779.0345 812.6952 824.5494 870.8034 892.6762 897.1081 906.6527 913.7420 944.8974 974.2585 979.9000 1000.2628 1034.3578 1059.9539 1067.8754 1084.7069 1104.7355 1113.1857 1115.0613 1122.6466 1132.1897 1146.3513 1153.6045 1160.5653 1168.5247 1187.0071 1199.1052 1235.9671 1258.0397 1273.2980 1288.5797 1308.4505 1330.2350 1368.4470 1386.0244 1412.2595 1429.3757 1437.3683 1443.5350 1454.9496 1457.2242 1458.2537 1460.6370 1463.8358 1469.5844 1477.5509 1486.7799 1493.8622 1575.1059 1591.4760 1613.3313 1641.3129 2925.8554 2940.1529 2975.9833 2978.8438 2997.7885 3002.1445 3044.3567 3074.3714 3078.2454 3104.4854 3124.4234 3127.3963 3127.9054 3132.6511 3138.8282 3154.6931 3159.4601 3172.1766
redmass: 3.6597 5.1352 3.8645 2.9670 5.1325 3.0460 3.3655 3.2243 2.7453 3.9547 1.1815 2.3825 3.5003 1.1420 4.3451 1.5396 2.5146 4.0075 4.5659 3.6837 4.2948 5.0506 5.4718 4.4590 3.3212 5.9412 6.0959 4.4558 4.7997 4.3755 4.1950 5.8307 6.6714 4.8171 1.8726 5.4515 2.4812 1.1985 6.8509 1.9132 4.8010 1.5605 4.3313 9.1055 1.3678 5.2298 5.4054 1.1704 4.4031 2.0177 4.2746 1.3132 1.2460 1.2371 3.0760 1.5306 1.4211 1.3497 1.5032 2.3708 1.3199 1.1970 2.4528 1.7000 1.1196 1.7880 1.7029 1.3443 6.4110 1.3615 1.6569 1.2918 1.1523 1.7011 1.1066 1.0518 1.0647 1.2416 1.6867 1.0584 1.0714 1.0522 1.0759 6.6638 6.4388 10.2943 5.7985 1.0363 1.0537 1.0310 1.0305 1.1050 1.1036 1.0579 1.1034 1.1046 1.0974 1.1031 1.1084 1.1031 1.0910 1.0861 1.0922 1.0902 1.0990
irintensity: 1.6135 1.0018 0.9099 3.9329 2.7465 2.4081 4.7465 2.8975 8.0350 0.3851 0.2078 0.2928 5.2518 0.1094 0.5812 1.5495 9.0255 5.7032 6.7587 3.5608 23.4800 0.1712 14.7484 5.5310 12.6543 12.2960 7.9598 1.8071 0.1090 8.8677 0.7339 4.6316 7.6547 36.4888 30.7549 17.4953 40.9540 0.3426 4.9624 11.7543 31.8269 4.1991 1.7301 57.8201 2.2766 115.1635 29.5133 39.0545 100.9882 42.5275 192.4189 3.6355 28.2018 4.8897 455.1391 2.1700 3.6055 0.8436 10.8934 37.7515 22.5501 23.2182 162.5291 204.9772 4.3086 5.8651 10.8248 7.0056 44.3418 9.3872 25.6398 7.1971 0.2074 65.5908 23.9999 13.6538 19.7604 8.2754 13.0075 14.4761 4.4252 21.4423 5.4226 26.4445 31.0884 289.5772 147.7070 76.4964 59.6460 81.9356 52.0029 73.4851 37.4799 33.2853 26.1136 22.3815 35.7198 23.7975 14.3367 16.5843 2.7608 4.7210 7.3072 7.1789 16.0322
temp: 298.150 k
press: 1.00000 atm
elementType: 8 8 8 8 8 6 6 6 6 6 6 6 6 6 6 6 6 6 6 1 1 1 1 1 1 1 1 1 1 1 1 1 1 1 1 1 1
symmnumber: 1
zpe: 773136.9 jmol-1
zpe.correction: 0.294472 hartree
zpe.thermalcorrener: 0.314555 hartree
zpe.thermalcorrenthalpy: 0.315499 hartree
zpe.thermalcorrgfe: 0.244094 hartree
zpe.sumelectzpe: -918.894203 hartree
zpe.sumelectthermal: -918.874121 hartree
zpe.sumelectthermalent: -918.873177 hartree
zpe.sumelectthermalfe: -918.944581 hartree
dipole: 2.3554 0.5931 1.9459
dipole: 3.1122
quadrupole: -101.3333 -104.2260 -108.3948
quadrupole: -4.5124 -6.7768 -0.1811
quadrupole: 3.3181 0.4253 -3.7434 -4.5124 -6.7768 -0.1811
hfenergy: -919.1886756 hartree
pointgroup: C01 [X(C14H18O5)]
dipole: 0.9195403 -0.6876691 -0.4252428 debye
polarizability: 304.1399575|-12.5077207|148.3825594|-12.7196409|-34.1080121|130.4901847 unknown
InChI: InChI=1S/C14H18O5/c1-16-9-10-19-13(15)8-7-11-5-4-6-12(17-2)14(11)18-3/h4-8H,9-10H2,1-3H3
charge 0 multiplicity 1
37 atoms
O  2.396947 1.222807 -0.72879
O  5.060755 0.172996 -0.319236
O  -3.349872 -0.353048 1.403669
O  -6.718876 0.133945 -0.070518
O  -2.453905 1.305167 0.007553
C  1.497611 -0.497041 0.755636
C  2.621475 0.118951 0.120384
C  3.931803 -0.410251 0.299852
C  1.733337 -1.624274 1.596887
C  4.137021 -1.51032 1.156817
C  0.162936 0.067395 0.526219
C  3.034698 -2.112508 1.80903
C  -4.701479 0.229184 1.201644
C  -5.324678 -0.314721 -0.089448
C  -1.015813 -0.378514 1.061017
C  -2.286482 0.297843 0.742107
C  3.011044 2.498417 -0.281181
C  5.069058 0.100506 -1.800763
C  -7.44379 -0.266749 -1.27414
H  0.887394 -2.110766 2.092851
H  5.157811 -1.88279 1.288152
H  0.116785 0.932504 -0.147539
H  3.198203 -2.970381 2.469327
H  -5.285288 -0.095664 2.076269
H  -4.633486 1.329428 1.163826
H  -4.790911 0.085561 -0.976859
H  -5.269495 -1.425525 -0.103395
H  -1.086173 -1.235586 1.737843
H  2.781887 3.224189 -1.075597
H  2.551344 2.822895 0.6708
H  4.102475 2.385129 -0.156873
H  4.175272 0.589986 -2.226739
H  5.111475 -0.95573 -2.127178
H  5.98441 0.626054 -2.11198
H  -6.984778 0.166655 -2.188089
H  -7.476631 -1.372413 -1.380494
H  -8.468587 0.120173 -1.160671
