program: Gaussian 09
title: 000253996
version: EM64L-G09RevD.01
frameworkgroup: C1[X(C10H14ClN3O2)]
method: RPBEPBE
basis: SDD
operation: Freq
keyword: #p
keyword: freq=noraman
keyword: PBEPBE/SDD
title: #p freq=noraman PBEPBE/SDD
converged: YES YES NO NO
title: Mulliken charges:
elementType: Cl O O N N N C C C C C C C C C C H H H H H H H H H H H H H H
charge: -0.041573 -0.275714 -0.266736 -0.084541 0.019585 -0.587828 0.002600 -0.422504 -0.510969 -0.298149 -0.324399 0.439455 0.099929 -0.359740 -0.788721 -0.053259 0.220744 0.242966 0.227827 0.208984 0.258101 0.212556 0.228778 0.217119 0.233920 0.233636 0.259330 0.238722 0.335929 0.333950
chargesum: 0.00000
title: Mulliken charges with hydrogens summed into heavy atoms:
elementType: Cl O O N N N C C C C C C C C C C
charge: -0.041573 -0.275714 -0.266736 -0.084541 0.019585 0.082052 0.223344 0.048289 -0.043884 0.143184 0.126640 0.439455 0.099929 -0.359740 -0.057032 -0.053259
polarizability: 1.97660909e+02 9.48860742e+00 1.48271106e+02 1.47036639e+01 -4.65652161e+00 9.27976867e+01
1716.lowfreq: -13.7566 -3.8857 -0.0017 -0.0015 -0.0011 4.6130 14.7582 29.0652 45.1066
frequency: 14.4661 28.9394 45.0302 50.4388 98.0318 108.6733 147.8161 169.8993 183.8426 213.7783 230.5004 251.4436 292.5692 305.4150 329.1427 377.6814 416.7097 469.7495 475.2646 516.1797 522.0591 527.4868 561.6957 579.6726 613.9902 674.1390 677.5336 745.0704 760.6666 783.7666 797.8040 834.7789 856.3612 879.9433 926.7772 931.0373 971.9848 983.2095 991.3623 1024.2419 1042.0700 1052.4147 1076.3442 1098.1330 1113.1318 1147.3575 1157.5568 1186.2615 1195.2605 1236.8221 1269.5923 1279.3846 1294.5499 1315.5344 1322.5064 1325.7252 1341.0402 1361.3718 1366.7315 1390.8123 1446.8427 1455.5312 1468.8906 1472.1829 1475.9945 1476.9688 1483.8414 1490.3570 1572.1172 1611.7103 2986.6054 2989.9036 2995.1999 2998.2409 2999.0235 3006.0418 3053.0191 3065.3542 3075.0882 3091.9533 3106.9829 3123.2438 3561.6373 3720.0947
redmass: 4.3734 5.1517 4.6895 4.7068 3.9941 4.3720 1.1094 3.1875 6.1403 4.3386 3.3904 2.8849 3.0261 4.9444 2.9040 8.0684 4.0014 3.6751 1.2437 2.8673 1.2636 3.4695 3.5353 5.3417 2.3657 5.5011 6.6304 2.0790 5.0184 6.9526 4.0743 2.5577 2.3506 4.9689 2.6407 3.4406 2.7142 2.1015 3.2622 3.2623 1.7704 2.3167 2.0117 2.2783 2.1176 2.9329 1.1376 1.5824 1.2702 1.1804 1.8224 1.2667 2.0246 1.7593 2.0880 1.3515 1.3983 1.4034 4.0106 1.3591 1.3018 1.1189 1.1443 1.0896 1.1502 2.2222 1.0947 3.3532 4.6334 1.7342 1.0390 1.0701 1.0648 1.0606 1.0810 1.0628 1.0984 1.0965 1.1032 1.1003 1.1025 1.0983 1.0442 1.1060
irintensity: 4.0471 1.7276 0.1158 5.5314 1.5168 5.4784 1.5134 1.8986 3.7745 2.8953 1.4752 2.4859 12.0072 5.6023 0.7069 12.8538 1.3068 10.4138 312.3245 9.8538 0.8260 3.3119 1.1217 6.9242 4.9719 6.4029 5.0640 6.3235 19.2947 7.4514 15.9408 61.5271 9.8776 10.2700 42.2637 0.0490 19.3991 46.4140 29.8588 16.0807 4.1881 8.9245 5.1537 101.4886 74.2675 34.5967 0.7083 14.5508 11.7530 0.3724 6.7023 10.8211 0.4081 36.5137 63.4999 3.3366 8.6489 36.5431 28.9924 33.7610 27.4755 19.0906 34.0181 9.7119 14.2129 117.6589 9.7648 174.7896 197.9799 629.2851 8.4864 61.5469 50.9852 2.0218 41.6452 51.4283 2.8582 14.7380 28.9862 23.8317 35.5761 10.8982 143.0226 51.0270
temp: 298.150 k
press: 1.00000 atm
elementType: 17 8 8 7 7 7 6 6 6 6 6 6 6 6 6 6 1 1 1 1 1 1 1 1 1 1 1 1 1 1
symmnumber: 1
zpe: 620075.8 jmol-1
zpe.correction: 0.236174 hartree
zpe.thermalcorrener: 0.252204 hartree
zpe.thermalcorrenthalpy: 0.253148 hartree
zpe.thermalcorrgfe: 0.189986 hartree
zpe.sumelectzpe: -1163.001163 hartree
zpe.sumelectthermal: -1162.985133 hartree
zpe.sumelectthermalent: -1162.984189 hartree
zpe.sumelectthermalfe: -1163.047351 hartree
dipole: 0.1157 1.0306 0.6270
dipole: 1.2119
quadrupole: -76.0262 -102.9877 -104.3578
quadrupole: 6.1321 2.2726 -5.7241
quadrupole: 18.4311 -8.5305 -9.9006 6.1321 2.2726 -5.7241
hfenergy: -1163.237337 hartree
pointgroup: C01 [X(C10H14Cl1N3O2)]
dipole: -0.0416386 -0.4131513 0.2343436 debye
polarizability: 197.3909728|10.3053992|148.073807|-14.9113549|6.200891|93.2649223 unknown
InChI: InChI=1S/C10H14ClN3O2/c1-6-7(9(11)14-10(12)13-6)2-3-8-15-4-5-16-8/h8H,2-5,12H2,1H3
charge 0 multiplicity 1
30 atoms
Cl -0.420048 2.584238 -0.290421
O  3.760086 -0.886127 0.981133
O  3.412141 0.437564 -0.962187
N  -3.179812 -1.050598 0.136297
N  -2.740727 1.340769 0.286558
N  -4.840117 0.454222 0.84356
C  2.891569 -0.72095 -0.207644
C  1.448776 -0.519805 0.263443
C  0.46107 -0.389849 -0.928064
C  4.846671 0.117694 0.872854
C  4.216202 1.221387 0.004773
C  -0.965707 -0.171652 -0.470782
C  -1.899802 -1.248248 -0.298342
C  -1.498022 1.098864 -0.139425
C  -1.518195 -2.681866 -0.598242
C  -3.554896 0.239558 0.410317
H  3.000346 -1.592325 -0.883146
H  1.403191 0.386095 0.894484
H  1.175001 -1.380194 0.904278
H  0.518735 -1.299456 -1.55471
H  0.791461 0.456753 -1.556461
H  5.730829 -0.330248 0.379364
H  5.099798 0.437432 1.896412
H  3.568056 1.893737 0.600296
H  4.940238 1.808394 -0.580395
H  -0.60189 -2.981718 -0.058391
H  -2.344492 -3.344109 -0.299953
H  -1.324075 -2.826116 -1.677945
H  -5.142947 1.401223 1.054006
H  -5.46554 -0.340268 0.944731
